{"text_format":"1","workbook":"xlsx","n_sheets":5,"sheets":["DADOS","BDI (1)","PO","PLQ","CFF"],"not_rendered":{"charts":0,"images":17,"macros":1,"external_links":0,"defined_names":122,"comments":0,"pivot_tables":0},"unopened":[],"bounds":{"document_bytes":16777216,"sheet_cells":100000,"rows_first":2000,"rows_last":500,"rows_between":2000,"halvings":0,"cell_chars":16384,"cell_head_chars":4096},"cells_cut":0,"cells_raw":0,"read":"whole","date_system":"1900"}

{"sheet":"DADOS","index":0,"n_rows":230,"n_cols":24,"rows_kept":230,"cut":false,"hidden":false,"merged":[[37,6,37,18],[85,0,85,23],[37,3,37,5],[41,2,41,6],[67,0,67,23],[77,0,77,23],[70,0,70,23],[71,0,71,23],[15,0,15,23],[17,0,17,23],[21,0,21,8],[75,0,75,23],[83,0,83,23],[76,0,76,23],[78,0,78,23],[81,0,81,23],[219,9,219,14],[98,0,98,23],[97,0,97,23],[96,0,96,23],[25,0,25,23],[27,0,27,1],[28,0,28,1],[68,0,68,23],[59,0,59,23],[61,0,61,23],[100,0,100,23],[94,0,94,23],[95,0,95,23],[37,0,37,1],[41,20,41,21],[69,0,69,23],[39,0,39,23],[99,0,99,23],[73,0,73,23],[80,0,80,23],[89,0,89,23],[92,0,92,23],[93,0,93,23],[91,0,91,23],[0,1,1,23],[55,7,55,10],[41,22,41,23],[36,0,36,1],[41,0,41,1],[42,22,42,23],[42,14,42,19],[42,2,42,6],[41,10,41,12],[42,20,42,21],[34,0,34,23],[36,6,36,18],[36,3,36,5],[3,0,3,23],[5,0,5,23],[7,0,7,23],[23,0,23,23],[13,0,13,23],[9,0,9,23],[11,0,11,23],[41,7,41,8],[55,1,55,4],[41,14,41,19],[42,0,42,1],[223,0,223,5],[223,6,223,9],[222,6,222,9],[219,2,219,4],[86,0,86,23],[228,22,228,23],[228,20,228,21],[42,7,42,8],[226,0,226,1],[225,6,225,18],[225,0,225,1],[219,0,219,1],[226,3,226,5],[47,0,47,2],[56,7,56,10],[53,1,53,4],[64,0,64,23],[54,7,54,10],[44,0,44,23],[62,0,62,23],[49,0,49,23],[54,1,54,4],[56,1,56,4],[53,7,53,10],[229,14,229,19],[228,7,228,8],[228,10,228,12],[228,14,228,19],[229,22,229,23],[223,16,223,23],[222,10,222,15],[79,0,79,23],[82,0,82,23],[229,0,229,1],[229,20,229,21],[229,10,229,12],[220,9,220,14],[226,6,226,18],[228,0,228,1],[228,2,228,6],[229,2,229,6],[229,7,229,8],[223,10,223,15],[222,16,222,23],[225,3,225,5],[84,0,84,23],[220,0,220,1],[222,0,222,5],[220,2,220,4],[219,5,219,8],[220,5,220,8],[219,15,219,23],[220,15,220,23],[27,9,27,14],[31,6,31,9],[30,10,30,15],[31,10,31,15],[27,15,27,23],[30,16,30,23],[31,16,31,23],[30,0,30,5],[27,2,27,4],[28,2,28,4],[27,5,27,8],[28,5,28,8],[31,0,31,5],[30,6,30,9],[28,15,28,23],[28,9,28,14],[66,0,66,23],[87,0,87,23],[42,10,42,12]]}
[27476,"PO - Planilha Orçamentária / PLQ - Planilha de Levantamento de Quantidades / CFF - Cronograma Físico Financeiro"]
["v008"]
[]
["INSTRUÇÕES DE USO E PREENCHIMENTO"]
[]
["1. Este documento somente pode ser utilizado nas versões do Excel 2003 ou superior. Não deve ser utilizado versões do BROffice. O Documento deve ser salvo SOMENTE em extensão habilitada para macros (.xls ou .xlsm). Se o documento for salvo na extensão .xlsx, o arquivo será INUTILIZADO. "]
[]
["2. Para funcionamento pleno desse arquivo, a Segurança de Macros do Excel deve ser habilitada."]
[]
["2.1  Na Versão Excel 2003, selecione na Faixa de Opções: Ferramentas --> Macro --> Segurança --> Na aba Nível de Segurança selecione a Opção \"Baixo\" --> Clique em OK --> Feche e abra o Excel novamente para utilizar a Planilha."]
[]
["2.2 Na Versão Excel 2007 ou superior, selecione na Faixa de Opções: Arquivo --> Opções --> Central de Confiabilidade --> Configurações da Central de Confiabilidade --> Configurações de Macro --> Habilitar todas as Macros --> Clique em OK --> Feche e abra o excel novamente para utilizar a Planilha."]
[]
["3. O Preenchimento deve ser feito somente nas células em amarelo. As outras células são de preenchimento Automático."]
[]
["4. Preferências de Elaboração do Orçamento"]
[]
["4.1. Preenchimento de Quantidades"]
[]
[]
[]
["5. Ordem de Preenchimento"]
[]
["5.1. na Aba DADOS"]
[]
["5.1.1. Preencha no Quadro abaixo os Dados do TC/CR:"]
[]
["Nº OPERAÇÃO",null,"GESTOR",null,null,"PROGRAMA",null,null,null,"AÇÃO / MODALIDADE",null,null,null,null,null,"OBJETO"]
["1076696-20",null,"Marino José Frey ",null,null,"Planejamento Urbano",null,null,null,"Pavimentação Asfáltica",null,null,null,null,null,"Pavimentação Asfáltica e construção de passeios públicos das Ruas Felipe Arsênio Bamberg e Amelda Tereza Bieger "]
[]
["PROPONENTE / TOMADOR",null,null,null,null,null,"MUNICÍPIO / UF",null,null,null,"LOCALIDADE / ENDEREÇO",null,null,null,null,null,"APELIDO DO EMPREENDIMENTO"]
["Prefeitura Muncipal de Tunápolis",null,null,null,null,null,"Tunápolis/SC",null,null,null,"Rua João Castilho nº 111"]
[]
[]
["5.1.2. Preencha no quadro abaixo as informações sobre o orçamento:"]
[]
["DATA BASE",null,"DESON.","LOCALIDADE DO SINAPI",null,null,"DESCRIÇÃO DO LOTE",null,null,null,null,null,null,null,null,null,null,null,null,"BDI 1","BDI 2","BDI 3","BDI 4","BDI 5"]
["2022-01-01",null,"Não","Florianópolis / SC",null,null,null,null,null,null,null,null,null,null,null,null,null,null,null,{"$f":"IF(ISERROR(INDIRECT(\"'BDI (\"&RIGHT(T37,1)&\")'!N27\")),\"\",INDIRECT(\"'BDI (\"&RIGHT(T37,1)&\")'!N27\"))","v":0.22},{"$f":"IF(ISERROR(INDIRECT(\"'BDI (\"&RIGHT(U37,1)&\")'!N27\")),\"\",INDIRECT(\"'BDI (\"&RIGHT(U37,1)&\")'!N27\"))","v":""},{"$f":"IF(ISERROR(INDIRECT(\"'BDI (\"&RIGHT(V37,1)&\")'!N27\")),\"\",INDIRECT(\"'BDI (\"&RIGHT(V37,1)&\")'!N27\"))","v":""},{"$f":"IF(ISERROR(INDIRECT(\"'BDI (\"&RIGHT(W37,1)&\")'!N27\")),\"\",INDIRECT(\"'BDI (\"&RIGHT(W37,1)&\")'!N27\"))","v":""},{"$f":"IF(ISERROR(INDIRECT(\"'BDI (\"&RIGHT(X37,1)&\")'!N27\")),\"\",INDIRECT(\"'BDI (\"&RIGHT(X37,1)&\")'!N27\"))","v":""}]
[]
["4.1.2. Preencha no quadro abaixo as informações sobre o orçamento licitado:"]
[]
["CTEF n.º",null,"NOME DA EMPRESA ",null,null,null,null,"DATA BASE",null,"DESON.","REGIME DE EXECUÇÃO",null,null,"ACOMP.","OBJETO CTEF",null,null,null,null,null,"DATA ASSINATURA",null,"VIGÊNCIA"]
[]
[]
["5.1.3. Preencha a data de Início da Obra:"]
[]
["DATA INÍCIO"]
["2022-04-11"]
[]
["5.1.4. Preencha no(s) Quadro(s) abaixo os Dados do(s) Responsável(is) Técnico(s) pela elaboração do Orçamento:"]
[]
[null,null,null,null,null,null,"Exibir o 2° Quadro de Assinatura?",null,null,null,"SIM"]
[]
["Nome:","Leonardo I. Massing Moreira ",null,null,null,null,"Nome:"]
[{"$f":"IF(OR(TipoOrçamento=\"BASE\",TipoOrçamento=\"REPROGRAMADONPL\"),\"Título:\",\"Cargo:\")","v":"Título:"},"Engenheiro Civil ",null,null,null,null,{"$f":"A55","v":"Título:"}]
[{"$f":"IF(OR(TipoOrçamento=\"BASE\",TipoOrçamento=\"REPROGRAMADONPL\"),\"CREA/CAU:\",\"Empresa:\")","v":"CREA/CAU:"},"140.221-0",null,null,null,null,{"$f":"A56","v":"CREA/CAU:"}]
[{"$f":"IF(OR(TipoOrçamento=\"BASE\",TipoOrçamento=\"REPROGRAMADONPL\"),\"ART/RRT:\",\"CNPJ:\")","v":"ART/RRT:"},null,null,null,null,null,{"$f":"A57","v":"ART/RRT:"}]
[]
[]
["5.2. Legenda das Abas"]
[]
["5.2.1.  LARANJA: Aba DADOS. Preenchimento Obrigatório. Impressão Dispensada."]
["5.2.2.  AMARELO: Abas BDI, PO, PLQ e CFF. Preenchimento e Impressão Obrigatórias. O preenchimento da Aba BDI é dispensada para os casos de Aquisição Direta de Materiais e Equipamentos. A Impressão da Aba PLQ pode ser dispensada para casos de Frente de Obra Única."]
[]
["5.3. na Aba BDI (Bonificações e Despesas Indiretas):"]
[]
["5.3.1. Escolha o tipo de empreendimento."]
["5.3.2. Escolha se o BDI será do tipo desonerado ou não (aba DADOS)"]
["5.3.3. Informe a base de cálculo do ISS (0 a 100%)."]
["5.3.4. Informe a alíquota do ISS (Normalmente de 2 a 5%)."]
["5.3.5. Defina na tabela os percentuais a serem adotados para cada item que compõe o BDI nos campos em amarelo."]
["5.3.6. Preencha o campo observações se necessário (recomendado para os orçamentos que utilizam mais de um BDI)."]
[]
["5.4. na Aba PO (Planilha Orçamentária):"]
[]
["5.4.1. Primeiramente, selecione os níveis de cada item do orçamento na coluna NÍVEL."]
["5.4.1.1: O nível de \"Serviço\" serve tanto para serviços ou insumos (mão-de-obra / material / equipamento / veículo / máquina / ferramenta / etc). Um \"nível 2/3/4\" é um título (é preenchida apenas a coluna descrição) utilizado para organizar melhor a planilha orçamentária e engloba (agrupa) serviços e agrupadores de nível inferior."]
["5.4.2. Após a seleção dos níveis, preencha, para cada serviço, as informações sobre a Fonte de Referência, (SINAPI, SICRO, SIURB, etc) e o respectivo Código de Referência."]
["5.4.3. Esta planilha é compatível com o arquivo REFERÊNCIA distribuído pela CAIXA. Caso o arquivo REFERÊNCIA esteja aberto, será possível buscar um código através do botão \"Buscar Código\". Desta forma a descrição dos serviços será preenchida automaticamente (podendo ser substituída). Caso contrário, seu preenchimento deve ser manual."]
["5.4.3.1. As descrições e unidades preenchidas automaticamente ficarão vinculadas ao arquivo REFERÊNCIA até que se use o botão \"Fixar Descrições\", que quebra a fórmula e transforma as descrições em texto."]
["5.4.4. Preencher o custo unitário do serviço/insumo na Coluna CUSTO UNITÁRIO. ATENÇÃO: o custo unitário adotado deve ser menor ou igual ao contido na tabela de referência ou mediana das cotações de mercado."]
["5.4.5. Indicar o BDI adotado para cada serviço/insumo na Coluna BDI. Preferencialmente selecione uma das opções da lista suspensa que aparecerá na célula, esta lista contém os 05 BDIs que podem ser preenchidos na Aba BDI (conforme item 5.2 das instruções). Caso seja necessária a adoção de mais de 05 valores diferentes de BDI, digite o percentual diretamente na célula."]
["5.4.6. Conforme selecionado no item 4.1. desta Aba, a Coluna Quantidade pode ser preenchida diretamente na PO, ou representar a soma das quantidades de cada Frente de Obra, informadas na aba PLQ (Planilha de Levantamento de Quantitativos)."]
["5.4.7. OBSERVAÇÃO: As demais colunas (Item / Quantidade / Preço Unitário / Preço Total) são de preenchimento automático. Não tente preenche-las ou alterá-las na Aba PO."]
["5.4.8. Se for necessário acrescentar ou excluir linhas da Planilha Orçamentária, utilize o Botão EDITAR PLANILHA e selecione as opções no quadro.\nATENÇÃO: quanto maior o número de linhas mais lento será o processamento dos dados, então acrescente apenas o número necessário ou um pouco a mais."]
["5.4.8.1. Evite deixar linhas em branco no corpo da Planilha Orçamentária."]
["5.4.9. Caso deseje importar os dados de outro arquivo utilize apenas a opção COLAR ESPECIAL ==> VALORES."]
["5.4.10. Clique no Botão LICITAR / REPROGRAMAR para preencher o Orçamento Licitado ou Reprogramado."]
[]
["5.5. na Aba PLQ (Planilha de Levantamento de Quantitativos):"]
[]
["5.5.1. Preencha primeiramente as Frentes de Obra."]
["5.5.1.1. Exemplos de Frentes de Obra (Rua A trecho 01 / Rua A trecho 02 / Rua B ; UH 01 / UH 02 / UH 03). "]
["5.5.2. Preencha as quantidades dos serviços por frente de obra. A soma das quantidades de todas as frentes de um determinado serviço será a quantidade exibida na Planilha Orçamentária."]
["5.5.3. Caso deseje incluir ou excluir frentes, utilize os botões ADICIONAR e EXCLUIR."]
[]
["5.6. na Aba CFF (Cronograma Físico-Financeiro):"]
[]
["5.6.1. Preencha a data de início da obra na aba Dados."]
["5.6.2. Preencha as porcentagens previstas por parcela para cada meta ou macrosserviço."]
["5.6.3. Para atualizar o Cronograma conforme o Orçamento e incluir ou excluir parcelas, utilize o botão EDITAR / ATUALIZAR CRONOGRAMA."]
[]
[]
[]
[]
[]
[null,null,null,null,null,null,null,null,null,null,null,"(Selecione uma Localidade)"]
[null,null,null,null,null,null,null,null,null,null,null,"Aracaju / SE",null,null,null,null,null,null,{"$f":"T38","v":0.22}]
[null,null,null,null,null,null,null,null,null,null,null,"Belém / PA",null,null,null,null,null,null,{"$f":"U38","v":""}]
[null,null,null,null,null,null,null,null,null,null,null,"Belo Horizonte / MG",null,null,null,null,null,null,{"$f":"V38","v":""}]
[null,null,null,null,null,null,null,null,null,null,null,"Boa Vista / RR",null,null,null,null,null,null,{"$f":"W38","v":""}]
[null,null,null,null,null,null,null,null,null,null,null,"Brasília / DF",null,null,null,null,null,null,{"$f":"X38","v":""}]
[null,null,null,null,null,null,null,null,null,null,null,"Campo Grande / MS"]
[null,null,null,null,null,null,null,null,null,null,null,"Cuiabá / MT"]
[null,null,null,null,null,null,null,null,null,null,null,"Curitiba / PR",null,null,null,"Empreitada Preço Global"]
[null,null,null,null,null,null,null,null,null,null,null,"Florianópolis / SC",null,null,null,"Empreitada Preço Unitário"]
[null,null,null,null,null,null,null,null,null,null,null,"Fortaleza / CE",null,null,null,"Empreitada Integral"]
[null,null,null,null,null,null,null,null,null,null,null,"Goiânia / GO",null,null,null,"Tarefa"]
[null,null,null,null,null,null,null,null,null,null,null,"João Pessoa / PB",null,null,null,"Contratação Integrada"]
[null,null,null,null,null,null,null,null,null,null,null,"Macapá / AP",null,null,null,"Não se aplica"]
[null,null,null,null,null,null,null,null,null,null,null,"Maceió / AL"]
[null,null,null,null,null,null,null,null,null,null,null,"Manaus / AM",null,null,null,"BM"]
[null,null,null,null,null,null,null,null,null,null,null,"Natal / RN",null,null,null,"PLE"]
[null,null,null,null,null,null,null,null,null,null,null,"Palmas / TO"]
[null,null,null,null,null,null,null,null,null,null,null,"Porto Alegre / RS"]
[null,null,null,null,null,null,null,null,null,null,null,"Porto Velho / RO"]
[null,null,null,null,null,null,null,null,null,null,null,"Recife / PE"]
[null,null,null,null,null,null,null,null,null,null,null,"Rio Branco / AC"]
[null,null,null,null,null,null,null,null,null,null,null,"Rio de Janeiro / RJ"]
[null,null,null,null,null,null,null,null,null,null,null,"Salvador / BA"]
[null,null,null,null,null,null,null,null,null,null,null,"São Luís / MA"]
[null,null,null,null,null,null,null,null,null,null,null,"São Paulo / SP"]
[null,null,null,null,null,null,null,null,null,null,null,"Teresina / PI"]
[null,null,null,null,null,null,null,null,null,null,null,"Vitória / ES"]
[]
[]
[]
[]
[]
[]
[]
[]
[]
[]
[]
[]
[]
[]
[]
[]
[]
[]
[]
[]
[]
[]
[]
[]
[]
[]
[]
[]
[]
[]
[]
[]
[]
[]
[]
[]
[]
[]
[]
[]
[]
[]
[]
[]
[]
[]
[]
[]
[]
[]
[]
[]
[]
[]
[]
[]
[]
[]
[]
[]
[]
[]
[]
[]
[]
[]
[]
[]
[]
[]
[]
[]
[]
[]
[]
[]
[]
[]
[]
[]
[]
[]
[]
[]
[]
[{"$f":"A28","v":"Nº OPERAÇÃO"},null,{"$f":"C28","v":"GESTOR"},null,null,{"$f":"F28","v":"PROGRAMA"},null,null,null,{"$f":"J28","v":"AÇÃO / MODALIDADE"},null,null,null,null,null,{"$f":"P28","v":"OBJETO"}]
[{"$f":"IF(A29=\"\",\"\",A29)","v":"1076696-20"},null,{"$f":"IF(C29=\"\",\"\",C29)","v":"Marino José Frey "},null,null,{"$f":"IF(F29=\"\",\"\",F29)","v":"Planejamento Urbano"},null,null,null,{"$f":"IF(J29=\"\",\"\",J29)","v":"Pavimentação Asfáltica"},null,{"$f":"IF(#REF!=\"\",\"\",#REF!)","v":{"$error":"#REF!"}},null,{"$f":"IF(#REF!=\"\",\"\",#REF!)","v":{"$error":"#REF!"}},null,{"$f":"IF(P29=\"\",\"\",P29)","v":"Pavimentação Asfáltica e construção de passeios públicos das Ruas Felipe Arsênio Bamberg e Amelda Tereza Bieger "}]
[]
[{"$f":"A31","v":"PROPONENTE / TOMADOR"},null,null,null,null,null,{"$f":"G31","v":"MUNICÍPIO / UF"},null,null,null,{"$f":"K31","v":"LOCALIDADE / ENDEREÇO"},null,null,null,null,null,{"$f":"Q31","v":"APELIDO DO EMPREENDIMENTO"}]
[{"$f":"IF(A32=\"\",\"\",A32)","v":"Prefeitura Muncipal de Tunápolis"},null,null,null,null,null,{"$f":"IF(G32=\"\",\"\",G32)","v":"Tunápolis/SC"},{"$f":"IF(I32=\"\",\"\",I32)","v":""},null,{"$f":"IF(#REF!=\"\",\"\",#REF!)","v":{"$error":"#REF!"}},{"$f":"IF(K32=\"\",\"\",K32)","v":"Rua João Castilho nº 111"},null,null,null,null,null,{"$f":"IF(Q32=\"\",\"\",Q32)","v":""}]
[]
[{"$f":"A37","v":"DATA BASE"},null,{"$f":"C37","v":"DESON."},{"$f":"D37","v":"LOCALIDADE DO SINAPI"},null,null,{"$f":"G37","v":"DESCRIÇÃO DO LOTE"},null,null,null,null,null,null,null,null,null,null,null,null,{"$f":"T37","v":"BDI 1"},{"$f":"U37","v":"BDI 2"},{"$f":"V37","v":"BDI 3"},{"$f":"W37","v":"BDI 4"},{"$f":"X37","v":"BDI 5"}]
[{"$f":"IF(A38=\"\",\"\",A38)","v":"2022-01-01"},null,{"$f":"IF(C38=\"\",\"\",C38)","v":"Não"},"Florianópolis / SC","","","","","","","","","","","","","","","",0.22,"","","",""]
[]
["CTEF n.º",null,"NOME DA EMPRESA / CNPJ:",null,null,null,null,"DATA BASE",null,"DESON.","REGIME DE EXECUÇÃO",null,null,"ACOMP.","OBJETO CTEF",null,null,null,null,null,"DATA ASSINATURA",null,"VIGÊNCIA"]
[{"$f":"IF(A43=\"\",\"\",A43)","v":""},null,{"$f":"IF(C43=\"\",\"\",C43)","v":""},null,{"$f":"IF(E43=\"\",\"\",E43)","v":""},null,{"$f":"IF(G43=\"\",\"\",G43)","v":""},{"$f":"IF(H43=\"\",\"\",H43)","v":""},{"$f":"IF(I43=\"\",\"\",I43)","v":""},{"$f":"IF(J43=\"\",\"\",J43)","v":""},{"$f":"IF(K43=\"\",\"\",K43)","v":""},null,{"$f":"IF(M43=\"\",\"\",M43)","v":""},{"$f":"IF(N43=\"\",\"\",N43)","v":""},{"$f":"IF(O43=\"\",\"\",O43)","v":""},null,{"$f":"IF(Q43=\"\",\"\",Q43)","v":""},null,{"$f":"IF(S43=\"\",\"\",S43)","v":""},null,{"$f":"IF(U43=\"\",\"\",U43)","v":""},null,{"$f":"IF(W43=\"\",\"\",W43)","v":""}]

{"sheet":"BDI (1)","index":1,"n_rows":59,"n_cols":23,"rows_kept":59,"cut":false,"hidden":false,"merged":[[49,9,49,11],[28,9,28,17],[25,8,25,11],[26,8,26,11],[26,15,26,17],[44,14,44,17],[30,8,30,17],[34,8,34,17],[41,14,41,17],[48,9,48,11],[39,8,39,17],[45,8,45,11],[45,14,45,17],[46,9,46,11],[46,15,46,17],[47,9,47,11],[15,19,23,20],[41,8,41,11],[17,8,17,11],[18,8,18,11],[19,8,19,11],[20,8,20,11],[21,8,21,11],[22,8,22,11],[23,8,23,11],[24,8,24,11],[15,17,16,17],[36,8,36,17],[31,15,32,15],[31,12,31,14],[32,12,32,14],[31,11,32,11],[10,8,10,15],[10,16,10,17],[3,8,3,9],[3,10,3,17],[4,8,4,9],[4,10,4,17],[6,8,6,17],[7,8,7,17],[9,8,9,15],[9,16,9,17],[47,15,47,17],[44,8,44,11],[42,8,42,11],[12,16,12,17],[13,8,13,15],[13,16,13,17],[15,12,16,12],[12,8,12,15],[15,15,16,15],[15,16,16,16],[15,13,16,13],[15,8,16,11],[15,14,16,14]]}
[null,null,null,null,"MIN","MED","MAX",null,null,null,null,null,null,{"$f":"\"Quadro de Composição do BDI \"&MID(CELL(\"nome.arquivo\",N1),5+FIND(\"BDI (\",CELL(\"nome.arquivo\",N1)),1)","v":"Quadro de Composição do BDI 1"}]
["Construção e Reforma de Edifícios","AC",{"$f":"CONCATENATE(A2,\"-\",B2)","v":"Construção e Reforma de Edifícios-AC"},null,0.03,0.04,5.5E-2]
[{"$f":"A2","v":"Construção e Reforma de Edifícios"},"SG","Construção e Reforma de Edifícios-SG",null,8.0000000000000002E-3,8.0000000000000002E-3,0.01]
[{"$f":"A3","v":"Construção e Reforma de Edifícios"},"R","Construção e Reforma de Edifícios-R",null,9.7000000000000003E-3,1.2699999999999999E-2,1.2699999999999999E-2,null,"Nº TC/CR",null,"PROPONENTE / TOMADOR"]
[{"$f":"A4","v":"Construção e Reforma de Edifícios"},"DF","Construção e Reforma de Edifícios-DF",null,5.8999999999999999E-3,1.23E-2,1.3899999999999999E-2,null,{"$f":"DADOS!A29","v":"1076696-20"},null,{"$f":"DADOS!A32","v":"Prefeitura Muncipal de Tunápolis"}]
[{"$f":"A5","v":"Construção e Reforma de Edifícios"},"L","Construção e Reforma de Edifícios-L",null,6.1600000000000002E-2,7.400000000000001E-2,8.9600000000000013E-2]
[{"$f":"A6","v":"Construção e Reforma de Edifícios"},"BDI PAD","Construção e Reforma de Edifícios-BDI PAD",null,0.2034,0.22120000000000001,0.25,null,"OBJETO"]
["Construção de Praças Urbanas, Rodovias, Ferrovias e recapeamento e pavimentação de vias urbanas","AC","Construção de Praças Urbanas, Rodovias, Ferrovias e recapeamento e pavimentação de vias urbanas-AC",null,3.7999999999999999E-2,4.0099999999999997E-2,4.6699999999999998E-2,null,{"$f":"DADOS!P29","v":"Pavimentação Asfáltica e construção de passeios públicos das Ruas Felipe Arsênio Bamberg e Amelda Tereza Bieger "}]
["Construção de Praças Urbanas, Rodovias, Ferrovias e recapeamento e pavimentação de vias urbanas","SG","Construção de Praças Urbanas, Rodovias, Ferrovias e recapeamento e pavimentação de vias urbanas-SG",null,3.2000000000000002E-3,4.0000000000000001E-3,7.4000000000000003E-3]
["Construção de Praças Urbanas, Rodovias, Ferrovias e recapeamento e pavimentação de vias urbanas","R","Construção de Praças Urbanas, Rodovias, Ferrovias e recapeamento e pavimentação de vias urbanas-R",null,5.0000000000000001E-3,5.6000000000000008E-3,9.7000000000000003E-3,null,"TIPO DE OBRA DO EMPREENDIMENTO",null,null,null,null,null,null,null,"DESONERAÇÃO"]
["Construção de Praças Urbanas, Rodovias, Ferrovias e recapeamento e pavimentação de vias urbanas","DF","Construção de Praças Urbanas, Rodovias, Ferrovias e recapeamento e pavimentação de vias urbanas-DF",null,1.0200000000000001E-2,1.11E-2,1.21E-2,null,"Construção de Praças Urbanas, Rodovias, Ferrovias e recapeamento e pavimentação de vias urbanas",null,null,null,null,null,null,null,{"$f":"DADOS!$C$38","v":"Não"}]
["Construção de Praças Urbanas, Rodovias, Ferrovias e recapeamento e pavimentação de vias urbanas","L","Construção de Praças Urbanas, Rodovias, Ferrovias e recapeamento e pavimentação de vias urbanas-L",null,6.6400000000000001E-2,7.2999999999999995E-2,8.6899999999999991E-2]
["Construção de Praças Urbanas, Rodovias, Ferrovias e recapeamento e pavimentação de vias urbanas","BDI PAD","Construção de Praças Urbanas, Rodovias, Ferrovias e recapeamento e pavimentação de vias urbanas-BDI PAD",null,0.19600000000000001,0.2097,0.24230000000000002,null,"Conforme legislação tributária municipal, definir estimativa de percentual da base de cálculo para o ISS:",null,null,null,null,null,null,null,1]
["Construção de Redes de Abastecimento de Água, Coleta de Esgoto","AC","Construção de Redes de Abastecimento de Água, Coleta de Esgoto-AC",null,3.4300000000000004E-2,4.9299999999999997E-2,6.7099999999999993E-2,null,"Sobre a base de cálculo, definir a respectiva alíquota do ISS (entre 2% e 5%):",null,null,null,null,null,null,null,0.03]
[{"$f":"A14","v":"Construção de Redes de Abastecimento de Água, Coleta de Esgoto"},"SG","Construção de Redes de Abastecimento de Água, Coleta de Esgoto-SG",null,2.8000000000000004E-3,4.8999999999999998E-3,7.4999999999999997E-3]
[null,null,null,null,null,null,null,null,"Itens",null,null,null,"Siglas","% Adotado","Situação","1º Quartil","Médio","3º Quartil",null,{"$f":"IF(V27,\"Para BDI fora do intervalo estatístico, deve ser apresentado Relatório Técnico Circunstanciado justificando a adoção do percentual de cada parcela do BDI.\",\"\")","v":""}]
[{"$f":"A15","v":"Construção de Redes de Abastecimento de Água, Coleta de Esgoto"},"R","Construção de Redes de Abastecimento de Água, Coleta de Esgoto-R",null,0.01,1.3899999999999999E-2,1.7399999999999999E-2]
[{"$f":"A17","v":"Construção de Redes de Abastecimento de Água, Coleta de Esgoto"},"DF","Construção de Redes de Abastecimento de Água, Coleta de Esgoto-DF",null,9.3999999999999986E-3,9.8999999999999991E-3,1.1699999999999999E-2,null,{"$f":"IF($I$11=$A$59,\"Encargos Sociais incidentes sobre a mão de obra\",\"Administração Central\")","v":"Administração Central"},null,null,null,{"$f":"IF($I$11=$A$59,\"K1\",\"AC\")","v":"AC"},4.0099999999999997E-2,"-",{"$f":"VLOOKUP(CONCATENATE(I$11,\"-\",M18),$C$2:$G$49,3,FALSE)","v":3.7999999999999999E-2},{"$f":"VLOOKUP(CONCATENATE(I$11,\"-\",M18),$C$2:$G$49,4,FALSE)","v":4.0099999999999997E-2},{"$f":"VLOOKUP(CONCATENATE(I$11,\"-\",M18),$C$2:$G$49,5,FALSE)","v":4.6699999999999998E-2}]
[{"$f":"A18","v":"Construção de Redes de Abastecimento de Água, Coleta de Esgoto"},"L","Construção de Redes de Abastecimento de Água, Coleta de Esgoto-L",null,6.7400000000000002E-2,8.0399999999999985E-2,9.4E-2,null,{"$f":"IF($I$11=$A$59,\"Administração Central da empresa ou consultoria - overhead\",\"Seguro e Garantia\")","v":"Seguro e Garantia"},null,null,null,{"$f":"IF($I$11=$A$59,\"K2\",\"SG\")","v":"SG"},4.0000000000000001E-3,"-",{"$f":"VLOOKUP(CONCATENATE(I$11,\"-\",M19),$C$2:$G$49,3,FALSE)","v":3.2000000000000002E-3},{"$f":"VLOOKUP(CONCATENATE(I$11,\"-\",M19),$C$2:$G$49,4,FALSE)","v":4.0000000000000001E-3},{"$f":"VLOOKUP(CONCATENATE(I$11,\"-\",M19),$C$2:$G$49,5,FALSE)","v":7.4000000000000003E-3}]
[{"$f":"A19","v":"Construção de Redes de Abastecimento de Água, Coleta de Esgoto"},"BDI PAD","Construção de Redes de Abastecimento de Água, Coleta de Esgoto-BDI PAD",null,0.20760000000000001,0.24179999999999999,0.26440000000000002,null,{"$f":"IF($I$11=$A$59,\"\",\"Risco\")","v":"Risco"},null,null,null,{"$f":"IF($I$11=$A$59,\"\",\"R\")","v":"R"},5.5999999999999999E-3,"-",{"$f":"VLOOKUP(CONCATENATE(I$11,\"-\",M20),$C$2:$G$49,3,FALSE)","v":5.0000000000000001E-3},{"$f":"VLOOKUP(CONCATENATE(I$11,\"-\",M20),$C$2:$G$49,4,FALSE)","v":5.6000000000000008E-3},{"$f":"VLOOKUP(CONCATENATE(I$11,\"-\",M20),$C$2:$G$49,5,FALSE)","v":9.7000000000000003E-3}]
["Construção e Manutenção de Estações e Redes de Distribuição de Energia Elétrica","AC","Construção e Manutenção de Estações e Redes de Distribuição de Energia Elétrica-AC",null,5.2900000000000003E-2,5.9200000000000003E-2,7.9299999999999995E-2,null,{"$f":"IF($I$11=$A$59,\"\",\"Despesas Financeiras\")","v":"Despesas Financeiras"},null,null,null,{"$f":"IF($I$11=$A$59,\"\",\"DF\")","v":"DF"},1.11E-2,"-",{"$f":"VLOOKUP(CONCATENATE(I$11,\"-\",M21),$C$2:$G$49,3,FALSE)","v":1.0200000000000001E-2},{"$f":"VLOOKUP(CONCATENATE(I$11,\"-\",M21),$C$2:$G$49,4,FALSE)","v":1.11E-2},{"$f":"VLOOKUP(CONCATENATE(I$11,\"-\",M21),$C$2:$G$49,5,FALSE)","v":1.21E-2}]
[{"$f":"A21","v":"Construção e Manutenção de Estações e Redes de Distribuição de Energia Elétrica"},"SG","Construção e Manutenção de Estações e Redes de Distribuição de Energia Elétrica-SG",null,2.5000000000000001E-3,5.1000000000000004E-3,5.6000000000000008E-3,null,{"$f":"IF($I$11=$A$59,\"Margem bruta da empresa de consultoria\",\"Lucro\")","v":"Lucro"},null,null,null,{"$f":"IF($I$11=$A$59,\"K3\",\"L\")","v":"L"},7.2999999999999995E-2,"-",{"$f":"VLOOKUP(CONCATENATE(I$11,\"-\",M22),$C$2:$G$49,3,FALSE)","v":6.6400000000000001E-2},{"$f":"VLOOKUP(CONCATENATE(I$11,\"-\",M22),$C$2:$G$49,4,FALSE)","v":7.2999999999999995E-2},{"$f":"VLOOKUP(CONCATENATE(I$11,\"-\",M22),$C$2:$G$49,5,FALSE)","v":8.6899999999999991E-2}]
[{"$f":"A22","v":"Construção e Manutenção de Estações e Redes de Distribuição de Energia Elétrica"},"R","Construção e Manutenção de Estações e Redes de Distribuição de Energia Elétrica-R",null,0.01,1.4800000000000001E-2,1.9699999999999999E-2,null,"Tributos (impostos COFINS 3%, e  PIS 0,65%)",null,null,null,"CP",3.6499999999999998E-2,"-",3.6499999999999998E-2,3.6499999999999998E-2,3.6499999999999998E-2]
[{"$f":"A23","v":"Construção e Manutenção de Estações e Redes de Distribuição de Energia Elétrica"},"DF","Construção e Manutenção de Estações e Redes de Distribuição de Energia Elétrica-DF",null,1.01E-2,1.0700000000000001E-2,1.11E-2,null,"Tributos (ISS, variável de acordo com o município)",null,null,null,"ISS",{"$f":"IF($I$11<>$A$58,Q14*Q13,0)","v":0.03},"-",0,2.5000000000000001E-2,0.05]
[{"$f":"A24","v":"Construção e Manutenção de Estações e Redes de Distribuição de Energia Elétrica"},"L","Construção e Manutenção de Estações e Redes de Distribuição de Energia Elétrica-L",null,0.08,8.3100000000000007E-2,9.5100000000000004E-2,null,"Tributos (Contribuição Previdenciária sobre a Receita Bruta - 0% ou 4,5% - Desoneração)",null,null,null,"CPRB",{"$f":"IF(AND($I$11<>$A$58,Q11=\"Sim\"),4.5%,0%)","v":0},{"$f":"IF(AND(N25>=P25, N25<=R25), \"OK\", \"Não OK\")","v":"OK"},0,4.4999999999999998E-2,4.4999999999999998E-2]
[{"$f":"A25","v":"Construção e Manutenção de Estações e Redes de Distribuição de Energia Elétrica"},"BDI PAD","Construção e Manutenção de Estações e Redes de Distribuição de Energia Elétrica-BDI PAD",null,0.24,0.25840000000000002,0.27860000000000001,null,"BDI SEM desoneração\n(Fórmula Acórdão TCU)",null,null,null,"BDI PAD",{"$f":"IF($I$11=$A$58,0,ROUND((((1+N18+N19+N20)*(1+N21)*(1+N22)/(1-(N23+N24)))-1),4))","v":0.22},{"$f":"IF(OR($I$11=$A$59,$I$11=$A$58,AND(N26>=P26, N26<=R26)), \"OK\", \"FORA DO INTERVALO\")","v":"OK"},{"$f":"IF($I$11=$A$58,0,VLOOKUP(CONCATENATE($I$11,\"-\",$M26),$C$2:$G$49,3,FALSE))","v":0.19600000000000001},{"$f":"IF($I$11=$A$58,0,VLOOKUP(CONCATENATE($I$11,\"-\",$M26),$C$2:$G$49,4,FALSE))","v":0.2097},{"$f":"IF($I$11=$A$58,0,VLOOKUP(CONCATENATE($I$11,\"-\",$M26),$C$2:$G$49,5,FALSE))","v":0.24230000000000002}]
["Obras Portuárias, Marítimas e Fluviais","AC","Obras Portuárias, Marítimas e Fluviais-AC",null,0.04,5.5199999999999999E-2,7.85E-2,null,"BDI COM desoneração",null,null,null,"BDI DES",{"$f":"IF($I$11=$A$58,0,ROUND((((1+N18+N19+N20)*(1+N21)*(1+N22)/(1-(N23+N24+N25)))-1),4))","v":0.22},{"$f":"IF(Q11<>\"Sim\",\"\",O26)","v":""},null,null,null,null,null,null,{"$f":"AND(COUNTA(N18:N23)=6,O26<>\"ok\",NOT(V29))","v":false},"pedir anexo"]
[{"$f":"A27","v":"Obras Portuárias, Marítimas e Fluviais"},"SG","Obras Portuárias, Marítimas e Fluviais-SG",null,8.1000000000000013E-3,1.2199999999999999E-2,1.9900000000000001E-2]
[{"$f":"A28","v":"Obras Portuárias, Marítimas e Fluviais"},"R","Obras Portuárias, Marítimas e Fluviais-R",null,1.46E-2,2.3199999999999998E-2,3.1600000000000003E-2,null,{"$f":"IF(V29,\"X\",\"\")","v":""},"Anexo: Relatório Técnico Circunstanciado justificando a adoção do percentual de cada parcela do BDI.",null,null,null,null,null,null,null,null,null,null,null,false,"anexo apresentado"]
[]
[null,null,null,null,null,null,null,null,"Os valores de BDI foram calculados com o emprego da fórmula:"]
[{"$f":"A29","v":"Obras Portuárias, Marítimas e Fluviais"},"DF","Obras Portuárias, Marítimas e Fluviais-DF",null,9.3999999999999986E-3,1.0200000000000001E-2,1.3300000000000001E-2,null,null,null,null,{"$f":"IF(Q11=\"Sim\",\"BDI.DES =\",\"BDI.PAD =\")","v":"BDI.PAD ="},{"$f":"IF($I$11=$A$59,\"(1+K1+K2)*(1+K3)\",\"(1+AC + S + R + G)*(1 + DF)*(1+L)\")","v":"(1+AC + S + R + G)*(1 + DF)*(1+L)"},null,null," - 1"]
[{"$f":"A32","v":"Obras Portuárias, Marítimas e Fluviais"},"L","Obras Portuárias, Marítimas e Fluviais-L",null,7.1399999999999991E-2,8.4000000000000005E-2,0.1043,null,null,null,null,null,{"$f":"IF(Q11=\"Sim\",\"(1-CP-ISS-CRPB)\",\"(1-CP-ISS)\")","v":"(1-CP-ISS)"}]
[{"$f":"A33","v":"Obras Portuárias, Marítimas e Fluviais"},"BDI PAD","Obras Portuárias, Marítimas e Fluviais-BDI PAD",null,0.22800000000000001,0.27479999999999999,0.3095]
[null,null,null,null,null,null,null,null,{"$f":"CONCATENATE(\"Declaro para os devidos fins que, conforme legislação tributária municipal, a base de cálculo para \",I11,\", é de \",Q13*100,\"%, com a respectiva alíquota de \",Q14*100,\"%.\")","v":"Declaro para os devidos fins que, conforme legislação tributária municipal, a base de cálculo para Construção de Praças Urbanas, Rodovias, Ferrovias e recapeamento e pavimentação de vias urbanas, é de 100%, com a respectiva alíquota de 3%."}]
[]
[null,null,null,null,null,null,null,null,{"$f":"CONCATENATE(\"Declaro para os devidos fins que o regime de Contribuição Previdenciária sobre a Receita Bruta adotado para elaboração do orçamento foi \",IF(Q11=\"Sim\",\"COM\",\"SEM\"),\" Desoneração, e que esta é a alternativa mais adequada para a Administração Pública.\")","v":"Declaro para os devidos fins que o regime de Contribuição Previdenciária sobre a Receita Bruta adotado para elaboração do orçamento foi SEM Desoneração, e que esta é a alternativa mais adequada para a Administração Pública."}]
["Fornecimento de Materiais e Equipamentos (aquisição indireta - em conjunto com licitação de obras)","AC","Fornecimento de Materiais e Equipamentos (aquisição indireta - em conjunto com licitação de obras)-AC",null,1.4999999999999999E-2,3.4500000000000003E-2,4.4900000000000002E-2]
[{"$f":"A38","v":"Fornecimento de Materiais e Equipamentos (aquisição indireta - em conjunto com licitação de obras)"},"SG","Fornecimento de Materiais e Equipamentos (aquisição indireta - em conjunto com licitação de obras)-SG",null,3.0000000000000001E-3,4.7999999999999996E-3,8.199999999999999E-3,null,"Observações:"]
[{"$f":"A39","v":"Fornecimento de Materiais e Equipamentos (aquisição indireta - em conjunto com licitação de obras)"},"R","Fornecimento de Materiais e Equipamentos (aquisição indireta - em conjunto com licitação de obras)-R",null,5.6000000000000008E-3,8.5000000000000006E-3,8.8999999999999999E-3]
[{"$f":"A40","v":"Fornecimento de Materiais e Equipamentos (aquisição indireta - em conjunto com licitação de obras)"},"DF","Fornecimento de Materiais e Equipamentos (aquisição indireta - em conjunto com licitação de obras)-DF",null,8.5000000000000006E-3,8.5000000000000006E-3,1.11E-2]
[{"$f":"A41","v":"Fornecimento de Materiais e Equipamentos (aquisição indireta - em conjunto com licitação de obras)"},"L","Fornecimento de Materiais e Equipamentos (aquisição indireta - em conjunto com licitação de obras)-L",null,3.5000000000000003E-2,5.1100000000000007E-2,6.2199999999999998E-2,null,{"$f":"PO!K69","v":"Tunápolis/SC"},null,null,null,null,null,{"$f":"PO!K72","v":"2022-04-11"}]
[{"$f":"A42","v":"Fornecimento de Materiais e Equipamentos (aquisição indireta - em conjunto com licitação de obras)"},"BDI PAD","Fornecimento de Materiais e Equipamentos (aquisição indireta - em conjunto com licitação de obras)-BDI PAD",null,0.111,0.14019999999999999,0.16800000000000001,null,"Local",null,null,null,null,null,"Data"]
["Estudos e Projetos, Planos e Gerenciamento e outros correlatos","K1","Estudos e Projetos, Planos e Gerenciamento e outros correlatos-K1",null,"-","-","-"]
[{"$f":"A44","v":"Estudos e Projetos, Planos e Gerenciamento e outros correlatos"},"K2","Estudos e Projetos, Planos e Gerenciamento e outros correlatos-K2",null,"-",0.2,"-"]
[{"$f":"A45","v":"Estudos e Projetos, Planos e Gerenciamento e outros correlatos"},"","Estudos e Projetos, Planos e Gerenciamento e outros correlatos-",null,"-","-","-",null,"Responsável Técnico",null,null,null,null,null,"Responsável Tomador"]
[{"$f":"A46","v":"Estudos e Projetos, Planos e Gerenciamento e outros correlatos"},"","Estudos e Projetos, Planos e Gerenciamento e outros correlatos-",null,"-","-","-",null,"Nome:",{"$f":"DADOS!B54","v":"Leonardo I. Massing Moreira "},null,null,null,null,"Nome:","Marino José Frey "]
[{"$f":"A47","v":"Estudos e Projetos, Planos e Gerenciamento e outros correlatos"},"K3","Estudos e Projetos, Planos e Gerenciamento e outros correlatos-K3",null,"-",0.12,"-",null,"Título:",{"$f":"DADOS!B55","v":"Engenheiro Civil "},null,null,null,null,"Cargo:","Prefeito Municipal  "]
[{"$f":"A48","v":"Estudos e Projetos, Planos e Gerenciamento e outros correlatos"},"BDI PAD","Estudos e Projetos, Planos e Gerenciamento e outros correlatos-BDI PAD",null,"-","-","-",null,{"$f":"DADOS!A56","v":"CREA/CAU:"},{"$f":"DADOS!B56","v":"140.221-0"}]
[null,null,null,null,null,null,null,null,{"$f":"DADOS!A57","v":"ART/RRT:"},{"$f":"DADOS!B57","v":0}]
[]
["Construção e Reforma de Edifícios"]
["Construção de Praças Urbanas, Rodovias, Ferrovias e recapeamento e pavimentação de vias urbanas"]
["Construção de Redes de Abastecimento de Água, Coleta de Esgoto"]
["Construção e Manutenção de Estações e Redes de Distribuição de Energia Elétrica"]
["Obras Portuárias, Marítimas e Fluviais"]
["Fornecimento de Materiais e Equipamentos (aquisição indireta - em conjunto com licitação de obras)"]
["Fornecimento de Materiais e Equipamentos (aquisição direta)"]
["Estudos e Projetos, Planos e Gerenciamento e outros correlatos"]

{"sheet":"PO","index":2,"n_rows":73,"n_cols":26,"rows_kept":73,"cut":false,"hidden":false,"merged":[[1,22,1,23],[65,10,65,19],[61,10,63,19],[58,12,58,19],[71,10,71,12],[68,10,68,12]]}
[null,null,null,null,null,null,null,null,null,null,null,null,null,"PO - PLANILHA ORÇAMENTÁRIA",null,null,null,null,null,"Grau de Sigilo"]
[null,"LOTE","Meta","Nível 2","Nível 3","Nível 4","Serviço",null,null,null,null,null,null,{"$f":"CHOOSE(1+LOG(1+2*(TipoOrçamento=\"BASE\")+4*(TipoOrçamento=\"LICITADO\")+8*(TipoOrçamento=\"REPROGRAMADOAC\")+16*(TipoOrçamento=\"REPROGRAMADONPL\"),2),\"nada\",\"Orçamento Base para Licitação\",\"Orçamento Licitado\",\"Orçamento Licitado Reprogramado\",\"Orçamento Base para Licitação - Reprogramado\")","v":"Orçamento Base para Licitação"},null,null,null,null,null,"#PUBLICO",null,null,"Arredondamento"]
[null,null,null,null,null,null,null,null,null,null,null,null,null,null,null,null,null,null,null,null,null,null,"Quantidade",true]
["Nmax",null,null,null,null,null,null,null,null,null,null,null,null,null,null,null,null,null,null,null,"ERRO GERAL",null,"Custo Unitáro",true]
[{"$f":"MAX($A$12:$A$58)","v":3},null,null,null,null,null,null,null,null,null,null,null,null,null,null,null,null,null,null,null,{"$f":"IF(COUNTIF($U$12:OFFSET($U$58,-1,0),\"DESCRIÇÃO\")+COUNTIF($U$12:OFFSET($U$58,-1,0),\"UNIDADE\")+COUNTIF($U$12:OFFSET($U$58,-1,0),\"SEM VALOR\")>0,\"NÃO OK\",\"OK\")","v":"NÃO OK"},"","BDI",true]
[null,null,null,null,null,null,null,null,null,null,null,null,null,null,null,null,null,null,null,null,null,null,"Preço Unitário",true]
[null,null,null,null,null,null,null,null,null,null,null,null,null,null,null,null,null,null,null,null,null,null,"Preço Total",true]
[]
[null,null,null,null,null,null,null,null,null,null,null,null,null,null,null,{"$f":"OFFSET(PLQ!$E$12,ROW($P9)-ROW(P$12),0)","v":"-"}]
["Nível","Altura","n1","n2","n3","n4","n5","Czero","Cnível","Nível","Item","Fonte","Código","Descrição","Unidade","Quantidade",{"$f":"IF(OR(TipoOrçamento=\"LICITADO\",TipoOrçamento=\"REPROGRAMADOAC\"),\"Preço Unitário (R$)\",\"Custo Unitário (R$)\")","v":"Custo Unitário (R$)"},"BDI\n(%)","Preço Unitário (R$)","Preço Total\n(R$)","Erro de Dados","Lista Crono","Concatenação Fonte-Código","BancoRef",{"$f":"IF(TipoOrçamento=\"LICITADO\",\"Preço Unitário Edital (R$)\",\"Custo Unitário Referência (R$)\")","v":"Custo Unitário Referência (R$)"},{"$f":"IF(TipoOrçamento=\"LICITADO\",\"Valor BDI Edital\",\"Valor BDI\")","v":"Valor BDI"}]
[{"$f":"CHOOSE(1+LOG(1+2*(J11=\"Meta\")+4*(J11=\"Nível 2\")+8*(J11=\"Nível 3\")+16*(J11=\"Nível 4\")+32*(J11=\"Serviço\"),2),0,1,2,3,4,\"S\")","v":"S"},{"$f":"IF(OR(A11=\"S\",A11=0),0,IF(ISERROR(I11),H11,SMALL(H11:I11,1)))","v":0},{"$f":"IF($A11=1,OFFSET(C11,-1,0)+1,OFFSET(C11,-1,0))","v":"n1"},{"$f":"IF($A11=1,0,IF($A11=2,OFFSET(D11,-1,0)+1,OFFSET(D11,-1,0)))","v":"n2"},{"$f":"IF(AND($A11<=2,$A11<>0),0,IF($A11=3,OFFSET(E11,-1,0)+1,OFFSET(E11,-1,0)))","v":"n3"},{"$f":"IF(AND($A11<=3,$A11<>0),0,IF($A11=4,OFFSET(F11,-1,0)+1,OFFSET(F11,-1,0)))","v":"n4"},{"$f":"IF(AND($A11<=4,$A11<>0),0,IF($A11=\"S\",OFFSET(G11,-1,0)+1,OFFSET(G11,-1,0)))","v":{"$error":"#VALUE!"}},{"$f":"IF(OR($A11=\"S\",$A11=0),0,MATCH(0,OFFSET($B11,1,$A11,ROW($A$58)-ROW($A11)),0))","v":0},{"$f":"IF(OR($A11=\"S\",$A11=0),0,MATCH(OFFSET($B11,0,$A11)+1,OFFSET($B11,1,$A11,ROW($A$58)-ROW($A11)),0))","v":0},"Serviço",{"$f":"IF($A11=0,\"-\",CONCATENATE(C11&\".\",IF(AND($A$5>=2,$A11>=2),D11&\".\",\"\"),IF(AND($A$5>=3,$A11>=3),E11&\".\",\"\"),IF(AND($A$5>=4,$A11>=4),F11&\".\",\"\"),IF($A11=\"S\",G11&\".\",\"\")))","v":{"$error":"#VALUE!"}},null,null,{"$f":"IF($A11=\"S\",Referencia.Descricao,\"(digite a descrição aqui)\")","v":""},{"$f":"Referencia.Unidade","v":""},null,null,"BDI 1",{"$f":"IF($A11=\"S\",IF($Q$10=\"Preço Unitário (R$)\",PO.CustoUnitario,ROUND(PO.CustoUnitario*(1+$Z11),15-13*$X$6)),0)","v":0},{"$f":"IF($A11=\"S\",VTOTAL1,IF($A11=0,0,ROUND(SomaAgrup,15-13*$X$7)))","v":0},{"$f":"IF($J11=\"\",\"\",IF($N11=\"\",\"DESCRIÇÃO\",IF(AND($J11=\"Serviço\",$O11=\"\"),\"UNIDADE\",IF($T11<=0,\"SEM VALOR\",IF(AND($Y11<>\"\",$Q11>$Y11),\"ACIMA REF.\",\"\")))))","v":"DESCRIÇÃO"},{"$f":"IF(OR($A11=0,$A11=\"S\",$A11>CFF!$A$9),\"\",MAX(V$12:OFFSET(V11,-1,0))+1)","v":""},{"$f":"IF(AND($J11=\"Serviço\",$M11<>\"\"),IF($L11=\"\",$M11,CONCATENATE($L11,\"-\",$M11)))","v":false},{"$f":"IF(AND(Fonte<>\"\",Código<>\"\"),MATCH(Fonte&\" \"&IF(Fonte=\"sinapi\",SUBSTITUTE(SUBSTITUTE(Código,\"/00\",\"/\"),\"/0\",\"/\"),Código),INDIRECT(\"'[Referência \"&_xlnm.Database&\".xls]Banco'!$a:$a\"),0),\"X\")","v":"X"},{"$f":"IF(Import.Desoneracao=\"sim\",Referencia.Desonerado,Referencia.NaoDesonerado)","v":0},{"$f":"ROUND(IF(ISNUMBER(R11),R11,IF(LEFT(R11,3)=\"BDI\",HLOOKUP(R11,DADOS!$T$37:$X$38,2,FALSE),0)),15-11*$X$5)","v":0.22}]
[0,{"$f":"COUNTA(OFFSET(B12,1,0):B$58)","v":45},null,null,null,null,null,null,null,{"$f":"IF(OR(TipoOrçamento=\"LICITADO\",TipoOrçamento=\"REPROGRAMADOAC\"),\"CTEF\",\"LOTE\")","v":"LOTE"},0,null,null,{"$f":"IF(TipoOrçamento=\"LICITADO\",DADOS!O43,DADOS!G38)","v":0},null,null,null,null,null,{"$f":"SUMIF(OFFSET($J12,1,0,ROW(T58)-ROW(T12)-1),\"Serviço\",OFFSET(T12,1,0,ROW(T58)-ROW(T12)-1))","v":489719.26},{"$f":"IF($N12=0,\"DESCRIÇÃO\",\"\")","v":"DESCRIÇÃO"},0]
[{"$f":"CHOOSE(1+LOG(1+2*(J13=\"Meta\")+4*(J13=\"Nível 2\")+8*(J13=\"Nível 3\")+16*(J13=\"Nível 4\")+32*(J13=\"Serviço\"),2),0,1,2,3,4,\"S\")","v":1},{"$f":"IF(OR(A13=\"S\",A13=0),0,IF(ISERROR(I13),H13,SMALL(H13:I13,1)))","v":45},{"$f":"IF($A13=1,OFFSET(C13,-1,0)+1,OFFSET(C13,-1,0))","v":1},{"$f":"IF($A13=1,0,IF($A13=2,OFFSET(D13,-1,0)+1,OFFSET(D13,-1,0)))","v":0},{"$f":"IF(AND($A13<=2,$A13<>0),0,IF($A13=3,OFFSET(E13,-1,0)+1,OFFSET(E13,-1,0)))","v":0},{"$f":"IF(AND($A13<=3,$A13<>0),0,IF($A13=4,OFFSET(F13,-1,0)+1,OFFSET(F13,-1,0)))","v":0},{"$f":"IF(AND($A13<=4,$A13<>0),0,IF($A13=\"S\",OFFSET(G13,-1,0)+1,OFFSET(G13,-1,0)))","v":0},{"$f":"IF(OR($A13=\"S\",$A13=0),0,MATCH(0,OFFSET($B13,1,$A13,ROW($A$58)-ROW($A13)),0))","v":45},{"$f":"IF(OR($A13=\"S\",$A13=0),0,MATCH(OFFSET($B13,0,$A13)+1,OFFSET($B13,1,$A13,ROW($A$58)-ROW($A13)),0))","v":{"$error":"#N/A"}},"Meta",{"$f":"IF($A13=0,\"-\",CONCATENATE(C13&\".\",IF(AND($A$5>=2,$A13>=2),D13&\".\",\"\"),IF(AND($A$5>=3,$A13>=3),E13&\".\",\"\"),IF(AND($A$5>=4,$A13>=4),F13&\".\",\"\"),IF($A13=\"S\",G13&\".\",\"\")))","v":"1."},null,null,"PAVIMENTAÇÃO ASFÁLTICA","",0,null,"BDI 1",{"$f":"IF($A13=\"S\",IF($Q$10=\"Preço Unitário (R$)\",PO.CustoUnitario,ROUND(PO.CustoUnitario*(1+$Z13),15-13*$X$6)),0)","v":0},{"$f":"IF($A13=\"S\",VTOTAL1,IF($A13=0,0,ROUND(SomaAgrup,15-13*$X$7)))","v":489719.26},{"$f":"IF($J13=\"\",\"\",IF($N13=\"\",\"DESCRIÇÃO\",IF(AND($J13=\"Serviço\",$O13=\"\"),\"UNIDADE\",IF($T13<=0,\"SEM VALOR\",IF(AND($Y13<>\"\",$Q13>$Y13),\"ACIMA REF.\",\"\")))))","v":""},{"$f":"IF(OR($A13=0,$A13=\"S\",$A13>CFF!$A$9),\"\",MAX(V$12:OFFSET(V13,-1,0))+1)","v":1},{"$f":"IF(AND($J13=\"Serviço\",$M13<>\"\"),IF($L13=\"\",$M13,CONCATENATE($L13,\"-\",$M13)))","v":false},{"$f":"IF(AND(Fonte<>\"\",Código<>\"\"),MATCH(Fonte&\" \"&IF(Fonte=\"sinapi\",SUBSTITUTE(SUBSTITUTE(Código,\"/00\",\"/\"),\"/0\",\"/\"),Código),INDIRECT(\"'[Referência \"&_xlnm.Database&\".xls]Banco'!$a:$a\"),0),\"X\")","v":"X"},{"$f":"IF(Import.Desoneracao=\"sim\",Referencia.Desonerado,Referencia.NaoDesonerado)","v":0},{"$f":"ROUND(IF(ISNUMBER(R13),R13,IF(LEFT(R13,3)=\"BDI\",HLOOKUP(R13,DADOS!$T$37:$X$38,2,FALSE),0)),15-11*$X$5)","v":0.22}]
[2,44,1,1,0,0,0,44,{"$error":"#N/A"},"Nível 2","1.1.",null,null,"RUAS FELIPE ARSÊNIO BAMBERG E AMELDA TEREZA BIEGER ","",0,null,"BDI 1",0,489719.26,"",{"$f":"IF(OR($A14=0,$A14=\"S\",$A14>CFF!$A$9),\"\",MAX(V$12:OFFSET(V14,-1,0))+1)","v":2},false,"X",0,{"$f":"ROUND(IF(ISNUMBER(R14),R14,IF(LEFT(R14,3)=\"BDI\",HLOOKUP(R14,DADOS!$T$37:$X$38,2,FALSE),0)),15-11*$X$5)","v":0.22}]
[3,5,1,1,1,0,0,43,5,"Nível 3","1.1.1.",null,null,"SERVIÇOS PRELIMINARES ","",0,null,"BDI 1",0,5913.39,"",{"$f":"IF(OR($A15=0,$A15=\"S\",$A15>CFF!$A$9),\"\",MAX(V$12:OFFSET(V15,-1,0))+1)","v":3},false,"X",0,{"$f":"ROUND(IF(ISNUMBER(R15),R15,IF(LEFT(R15,3)=\"BDI\",HLOOKUP(R15,DADOS!$T$37:$X$38,2,FALSE),0)),15-11*$X$5)","v":0.22}]
["S",0,1,1,1,0,1,0,0,"Serviço","1.1.1.1.","SINAPI-I","4813","Placa de obra (construção civil) em chapa de aço galvanizado, nº22, adesivada.","m²",4.5,225,"BDI 1",274.5,1235.25,"ACIMA REF.",{"$f":"IF(OR($A16=0,$A16=\"S\",$A16>CFF!$A$9),\"\",MAX(V$12:OFFSET(V16,-1,0))+1)","v":""},"SINAPI-I-4813",{"$error":"#REF!"},0,{"$f":"ROUND(IF(ISNUMBER(R16),R16,IF(LEFT(R16,3)=\"BDI\",HLOOKUP(R16,DADOS!$T$37:$X$38,2,FALSE),0)),15-11*$X$5)","v":0.22}]
["S",0,1,1,1,0,2,0,0,"Serviço","1.1.1.2.","SINAPI-I ","4083","Encarregado geral de obra ","h",60,31.11,"BDI 1",37.950000000000003,2277,"ACIMA REF.",{"$f":"IF(OR($A17=0,$A17=\"S\",$A17>CFF!$A$9),\"\",MAX(V$12:OFFSET(V17,-1,0))+1)","v":""},"SINAPI-I -4083",{"$error":"#REF!"},0,{"$f":"ROUND(IF(ISNUMBER(R17),R17,IF(LEFT(R17,3)=\"BDI\",HLOOKUP(R17,DADOS!$T$37:$X$38,2,FALSE),0)),15-11*$X$5)","v":0.22}]
[{"$f":"CHOOSE(1+LOG(1+2*(J18=\"Meta\")+4*(J18=\"Nível 2\")+8*(J18=\"Nível 3\")+16*(J18=\"Nível 4\")+32*(J18=\"Serviço\"),2),0,1,2,3,4,\"S\")","v":"S"},{"$f":"IF(OR(A18=\"S\",A18=0),0,IF(ISERROR(I18),H18,SMALL(H18:I18,1)))","v":0},{"$f":"IF($A18=1,OFFSET(C18,-1,0)+1,OFFSET(C18,-1,0))","v":1},{"$f":"IF($A18=1,0,IF($A18=2,OFFSET(D18,-1,0)+1,OFFSET(D18,-1,0)))","v":1},{"$f":"IF(AND($A18<=2,$A18<>0),0,IF($A18=3,OFFSET(E18,-1,0)+1,OFFSET(E18,-1,0)))","v":1},{"$f":"IF(AND($A18<=3,$A18<>0),0,IF($A18=4,OFFSET(F18,-1,0)+1,OFFSET(F18,-1,0)))","v":0},{"$f":"IF(AND($A18<=4,$A18<>0),0,IF($A18=\"S\",OFFSET(G18,-1,0)+1,OFFSET(G18,-1,0)))","v":3},0,0,"Serviço",{"$f":"IF($A18=0,\"-\",CONCATENATE(C18&\".\",IF(AND($A$5>=2,$A18>=2),D18&\".\",\"\"),IF(AND($A$5>=3,$A18>=3),E18&\".\",\"\"),IF(AND($A$5>=4,$A18>=4),F18&\".\",\"\"),IF($A18=\"S\",G18&\".\",\"\")))","v":"1.1.1.3."},"SINAPI-I","2706","Engenheiro civil ","h",15,95,"BDI 1",{"$f":"IF($A18=\"S\",IF($Q$10=\"Preço Unitário (R$)\",PO.CustoUnitario,ROUND(PO.CustoUnitario*(1+$Z18),15-13*$X$6)),0)","v":115.9},{"$f":"IF($A18=\"S\",VTOTAL1,IF($A18=0,0,ROUND(SomaAgrup,15-13*$X$7)))","v":1738.5},{"$f":"IF($J18=\"\",\"\",IF($N18=\"\",\"DESCRIÇÃO\",IF(AND($J18=\"Serviço\",$O18=\"\"),\"UNIDADE\",IF($T18<=0,\"SEM VALOR\",IF(AND($Y18<>\"\",$Q18>$Y18),\"ACIMA REF.\",\"\")))))","v":"ACIMA REF."},{"$f":"IF(OR($A18=0,$A18=\"S\",$A18>CFF!$A$9),\"\",MAX(V$12:OFFSET(V18,-1,0))+1)","v":""},{"$f":"IF(AND($J18=\"Serviço\",$M18<>\"\"),IF($L18=\"\",$M18,CONCATENATE($L18,\"-\",$M18)))","v":"SINAPI-I-2706"},{"$f":"IF(AND(Fonte<>\"\",Código<>\"\"),MATCH(Fonte&\" \"&IF(Fonte=\"sinapi\",SUBSTITUTE(SUBSTITUTE(Código,\"/00\",\"/\"),\"/0\",\"/\"),Código),INDIRECT(\"'[Referência \"&_xlnm.Database&\".xls]Banco'!$a:$a\"),0),\"X\")","v":{"$error":"#REF!"}},{"$f":"IF(Import.Desoneracao=\"sim\",Referencia.Desonerado,Referencia.NaoDesonerado)","v":0},{"$f":"ROUND(IF(ISNUMBER(R18),R18,IF(LEFT(R18,3)=\"BDI\",HLOOKUP(R18,DADOS!$T$37:$X$38,2,FALSE),0)),15-11*$X$5)","v":0.22}]
["S",0,1,1,1,0,4,0,0,"Serviço","1.1.1.4.","SINAPI-I","7592","Topográfo para a marcação planialtimetrica da pavimentação ","h",24,22.63,"BDI 1",27.61,662.64,"ACIMA REF.",{"$f":"IF(OR($A19=0,$A19=\"S\",$A19>CFF!$A$9),\"\",MAX(V$12:OFFSET(V19,-1,0))+1)","v":""},"SINAPI-I-7592",{"$error":"#REF!"},0,{"$f":"ROUND(IF(ISNUMBER(R19),R19,IF(LEFT(R19,3)=\"BDI\",HLOOKUP(R19,DADOS!$T$37:$X$38,2,FALSE),0)),15-11*$X$5)","v":0.22}]
[3,7,1,1,2,0,0,38,7,"Nível 3","1.1.2.",null,null,"DRENAGEM E RECOMPOSIÇÃO DE PAVIMENTO ","",0,null,"BDI 1",0,83441.95,"",{"$f":"IF(OR($A20=0,$A20=\"S\",$A20>CFF!$A$9),\"\",MAX(V$12:OFFSET(V20,-1,0))+1)","v":4},false,"X",0,{"$f":"ROUND(IF(ISNUMBER(R20),R20,IF(LEFT(R20,3)=\"BDI\",HLOOKUP(R20,DADOS!$T$37:$X$38,2,FALSE),0)),15-11*$X$5)","v":0.22}]
["S",0,1,1,2,0,1,0,0,"Serviço","1.1.2.1.","SINAPI","90091","Escavação mecanizada de vala com profundidade até 1,5m, escavadeira hidraulica (0,8 m³), largura de 1,5 m até 2,5 m, locais cm baixo nivel de interferência. AF_02/2021","m³",299.2,2.4500000000000002,"BDI 1",2.99,894.61,"ACIMA REF.",{"$f":"IF(OR($A21=0,$A21=\"S\",$A21>CFF!$A$9),\"\",MAX(V$12:OFFSET(V21,-1,0))+1)","v":""},"SINAPI-90091",{"$error":"#REF!"},0,{"$f":"ROUND(IF(ISNUMBER(R21),R21,IF(LEFT(R21,3)=\"BDI\",HLOOKUP(R21,DADOS!$T$37:$X$38,2,FALSE),0)),15-11*$X$5)","v":0.22}]
["S",0,1,1,2,0,2,0,0,"Serviço","1.1.2.2.","SINAPI","102354","Desmonte de material de 3ª categoria (blocos de rochas ou matações) com martelete pneumatico hidráulico. Exclusive carga e transporte. AF_03/2021","m³",25,134.44999999999999,"BDI 1",164.03,4100.75,"ACIMA REF.",{"$f":"IF(OR($A22=0,$A22=\"S\",$A22>CFF!$A$9),\"\",MAX(V$12:OFFSET(V22,-1,0))+1)","v":""},"SINAPI-102354",{"$error":"#REF!"},0,{"$f":"ROUND(IF(ISNUMBER(R22),R22,IF(LEFT(R22,3)=\"BDI\",HLOOKUP(R22,DADOS!$T$37:$X$38,2,FALSE),0)),15-11*$X$5)","v":0.22}]
["S",0,1,1,2,0,3,0,0,"Serviço","1.1.2.3.","SINAPI-I","92210","Tubo de concreto para redes coletoras de águas pluviais, diâmetro de 400 mm, junta rigida, instalado em local de com baixo nivel de interferência - fornecimento e assentamento. AF_12/2015","m",38,124.45,"BDI 1",151.83000000000001,5769.54,"ACIMA REF.",{"$f":"IF(OR($A23=0,$A23=\"S\",$A23>CFF!$A$9),\"\",MAX(V$12:OFFSET(V23,-1,0))+1)","v":""},"SINAPI-I-92210",{"$error":"#REF!"},0,{"$f":"ROUND(IF(ISNUMBER(R23),R23,IF(LEFT(R23,3)=\"BDI\",HLOOKUP(R23,DADOS!$T$37:$X$38,2,FALSE),0)),15-11*$X$5)","v":0.22}]
["S",0,1,1,2,0,4,0,0,"Serviço","1.1.2.4.","SINAPI-I","92212","Tubo de concreto para redes coletoras de águas pluviais, diâmetro de 600 mm, junta rígida, instalado em loacal com baixo nivel de interferência - fornecimento e assentamento. AF_12/2015","m",219,217.28,"BDI 1",265.08,58052.52,"ACIMA REF.",{"$f":"IF(OR($A24=0,$A24=\"S\",$A24>CFF!$A$9),\"\",MAX(V$12:OFFSET(V24,-1,0))+1)","v":""},"SINAPI-I-92212",{"$error":"#REF!"},0,{"$f":"ROUND(IF(ISNUMBER(R24),R24,IF(LEFT(R24,3)=\"BDI\",HLOOKUP(R24,DADOS!$T$37:$X$38,2,FALSE),0)),15-11*$X$5)","v":0.22}]
["S",0,1,1,2,0,5,0,0,"Serviço","1.1.2.5.","SINAPI","97933","Caixa com grelha para boca de lobo simples retangular, em concreto pré moldado, dimensões 0,6x1,0x1,0 m. AF_12/2020","Unidade",16,688.29,"BDI 1",839.71,13435.36,"ACIMA REF.",{"$f":"IF(OR($A25=0,$A25=\"S\",$A25>CFF!$A$9),\"\",MAX(V$12:OFFSET(V25,-1,0))+1)","v":""},"SINAPI-97933",{"$error":"#REF!"},0,{"$f":"ROUND(IF(ISNUMBER(R25),R25,IF(LEFT(R25,3)=\"BDI\",HLOOKUP(R25,DADOS!$T$37:$X$38,2,FALSE),0)),15-11*$X$5)","v":0.22}]
["S",0,1,1,2,0,6,0,0,"Serviço","1.1.2.6.","SINAPI","93373","Reaterro e compactação de vala.","m³",118.68,8.2100000000000009,"BDI 1",10.02,1189.17,"ACIMA REF.",{"$f":"IF(OR($A26=0,$A26=\"S\",$A26>CFF!$A$9),\"\",MAX(V$12:OFFSET(V26,-1,0))+1)","v":""},"SINAPI-93373",{"$error":"#REF!"},0,{"$f":"ROUND(IF(ISNUMBER(R26),R26,IF(LEFT(R26,3)=\"BDI\",HLOOKUP(R26,DADOS!$T$37:$X$38,2,FALSE),0)),15-11*$X$5)","v":0.22}]
[3,2,1,1,3,0,0,31,2,"Nível 3","1.1.3.",null,null,"MEIOS - FIOS ","",null,null,"BDI 1",0,24165.81,"",{"$f":"IF(OR($A27=0,$A27=\"S\",$A27>CFF!$A$9),\"\",MAX(V$12:OFFSET(V27,-1,0))+1)","v":5},false,"X",0,{"$f":"ROUND(IF(ISNUMBER(R27),R27,IF(LEFT(R27,3)=\"BDI\",HLOOKUP(R27,DADOS!$T$37:$X$38,2,FALSE),0)),15-11*$X$5)","v":0.22}]
[{"$f":"CHOOSE(1+LOG(1+2*(J28=\"Meta\")+4*(J28=\"Nível 2\")+8*(J28=\"Nível 3\")+16*(J28=\"Nível 4\")+32*(J28=\"Serviço\"),2),0,1,2,3,4,\"S\")","v":"S"},{"$f":"IF(OR(A28=\"S\",A28=0),0,IF(ISERROR(I28),H28,SMALL(H28:I28,1)))","v":0},1,1,3,0,1,0,0,"Serviço",{"$f":"IF($A28=0,\"-\",CONCATENATE(C28&\".\",IF(AND($A$5>=2,$A28>=2),D28&\".\",\"\"),IF(AND($A$5>=3,$A28>=3),E28&\".\",\"\"),IF(AND($A$5>=4,$A28>=4),F28&\".\",\"\"),IF($A28=\"S\",G28&\".\",\"\")))","v":"1.1.3.1."},"SINAPI","94273","Assentamento de guia (meio-fio) em trecho reto, confecionada em  concreto pré fabricado, dimensões (100X15X13X30) cm, (comprimento X base inferior X base superior X altura), para vias urbanas. (uso viário). AF_06/2016  ","m",417.66,47.43,"BDI 1",57.86,24165.81,"ACIMA REF.",{"$f":"IF(OR($A28=0,$A28=\"S\",$A28>CFF!$A$9),\"\",MAX(V$12:OFFSET(V28,-1,0))+1)","v":""},"SINAPI-94273",{"$error":"#REF!"},0,{"$f":"ROUND(IF(ISNUMBER(R28),R28,IF(LEFT(R28,3)=\"BDI\",HLOOKUP(R28,DADOS!$T$37:$X$38,2,FALSE),0)),15-11*$X$5)","v":0.22}]
[3,10,1,1,4,0,0,29,10,"Nível 3","1.1.4.",null,null,"PAVIMENTAÇÃO ASFÁLTICA SOBRE LEITO NATURAL","",null,null,"BDI 1",0,295268.96000000002,"",{"$f":"IF(OR($A29=0,$A29=\"S\",$A29>CFF!$A$9),\"\",MAX(V$12:OFFSET(V29,-1,0))+1)","v":6},false,"X",0,{"$f":"ROUND(IF(ISNUMBER(R29),R29,IF(LEFT(R29,3)=\"BDI\",HLOOKUP(R29,DADOS!$T$37:$X$38,2,FALSE),0)),15-11*$X$5)","v":0.22}]
["S",0,1,1,4,0,1,0,0,"Serviço","1.1.4.1.","SINAPI","101116","Escavação horizontal em solo de 1ª categoria com trator de esteiras (170 hp/lamina: 5,20 m³). AF_07/202","m³",664.52,2.0699999999999998,"BDI 1",2.5299999999999998,1681.24,"ACIMA REF.",{"$f":"IF(OR($A30=0,$A30=\"S\",$A30>CFF!$A$9),\"\",MAX(V$12:OFFSET(V30,-1,0))+1)","v":""},"SINAPI-101116",{"$error":"#REF!"},0,{"$f":"ROUND(IF(ISNUMBER(R30),R30,IF(LEFT(R30,3)=\"BDI\",HLOOKUP(R30,DADOS!$T$37:$X$38,2,FALSE),0)),15-11*$X$5)","v":0.22}]
["S",0,1,1,4,0,2,0,0,"Serviço","1.1.4.2.","SINAPI","96385","Execução e compactação de aterro com solo predominantemente argiloso - exclusive escavação, carga e trasnporte e solo AF_09/2017","m³",127.5,9.33,"BDI 1",11.38,1450.95,"ACIMA REF.",{"$f":"IF(OR($A31=0,$A31=\"S\",$A31>CFF!$A$9),\"\",MAX(V$12:OFFSET(V31,-1,0))+1)","v":""},"SINAPI-96385",{"$error":"#REF!"},0,{"$f":"ROUND(IF(ISNUMBER(R31),R31,IF(LEFT(R31,3)=\"BDI\",HLOOKUP(R31,DADOS!$T$37:$X$38,2,FALSE),0)),15-11*$X$5)","v":0.22}]
["S",0,1,1,4,0,3,0,0,"Serviço","1.1.4.3.","SINAPI","100576","Regularização e compactação do subleito de solo predominantemente argiloso. AF_11/2019","m²",1898.65,2,"BDI 1",2.44,4632.71,"ACIMA REF.",{"$f":"IF(OR($A32=0,$A32=\"S\",$A32>CFF!$A$9),\"\",MAX(V$12:OFFSET(V32,-1,0))+1)","v":""},"SINAPI-100576",{"$error":"#REF!"},0,{"$f":"ROUND(IF(ISNUMBER(R32),R32,IF(LEFT(R32,3)=\"BDI\",HLOOKUP(R32,DADOS!$T$37:$X$38,2,FALSE),0)),15-11*$X$5)","v":0.22}]
["S",0,1,1,4,0,4,0,0,"Serviço","1.1.4.4.","SINAPI","96400","Execução e Compactação de base ou sub base em macadame -  exclusive escavação, carga e transporte - AF_09/2017 - espessura 18cm   ","m³",341.75,125.52,"BDI 1",153.13,52332.18,"ACIMA REF.",{"$f":"IF(OR($A33=0,$A33=\"S\",$A33>CFF!$A$9),\"\",MAX(V$12:OFFSET(V33,-1,0))+1)","v":""},"SINAPI-96400",{"$error":"#REF!"},0,{"$f":"ROUND(IF(ISNUMBER(R33),R33,IF(LEFT(R33,3)=\"BDI\",HLOOKUP(R33,DADOS!$T$37:$X$38,2,FALSE),0)),15-11*$X$5)","v":0.22}]
["S",0,1,1,4,0,5,0,0,"Serviço","1.1.4.5.","SINAPI","96396","Execução e Compactação de base e ou sub base com com brita graduada simples (BGS) - exclusive carga e transporte AF_09/2017- espessura 12 cm ","m³",227.84,140.51,"BDI 1",171.42,39056.33,"ACIMA REF.",{"$f":"IF(OR($A34=0,$A34=\"S\",$A34>CFF!$A$9),\"\",MAX(V$12:OFFSET(V34,-1,0))+1)","v":""},"SINAPI-96396",{"$error":"#REF!"},0,{"$f":"ROUND(IF(ISNUMBER(R34),R34,IF(LEFT(R34,3)=\"BDI\",HLOOKUP(R34,DADOS!$T$37:$X$38,2,FALSE),0)),15-11*$X$5)","v":0.22}]
["S",0,1,1,4,0,6,0,0,"Serviço","1.1.4.6.","Orç","AEI","Imprimação de base de pavimentação com com asfalto diluido imprimação. Taxa de aplicação de 1,2 L/m².","m²",1898.65,9.56,"BDI 1",11.66,22138.26,"ACIMA REF.",{"$f":"IF(OR($A35=0,$A35=\"S\",$A35>CFF!$A$9),\"\",MAX(V$12:OFFSET(V35,-1,0))+1)","v":""},"Orç-AEI",{"$error":"#REF!"},0,{"$f":"ROUND(IF(ISNUMBER(R35),R35,IF(LEFT(R35,3)=\"BDI\",HLOOKUP(R35,DADOS!$T$37:$X$38,2,FALSE),0)),15-11*$X$5)","v":0.22}]
["S",0,1,1,4,0,7,0,0,"Serviço","1.1.4.7.","SINAPI ","96402","Pintura de Ligação com emulsão  RR-2C  taxa de 0,60 L/m²","m²",1898.65,2.74,"BDI 1",3.34,6341.49,"ACIMA REF.",{"$f":"IF(OR($A36=0,$A36=\"S\",$A36>CFF!$A$9),\"\",MAX(V$12:OFFSET(V36,-1,0))+1)","v":""},"SINAPI -96402",{"$error":"#REF!"},0,{"$f":"ROUND(IF(ISNUMBER(R36),R36,IF(LEFT(R36,3)=\"BDI\",HLOOKUP(R36,DADOS!$T$37:$X$38,2,FALSE),0)),15-11*$X$5)","v":0.22}]
["S",0,1,1,4,0,8,0,0,"Serviço","1.1.4.8.","SINAPI","95995","Construção de  pavimento com aplicação de CBUQ, camada de rolamento, com espessura 5 cm, exclusive transporte. AF_03/2017","m³",94.94,1257.3399999999999,"BDI 1",1533.95,145633.21,"ACIMA REF.",{"$f":"IF(OR($A37=0,$A37=\"S\",$A37>CFF!$A$9),\"\",MAX(V$12:OFFSET(V37,-1,0))+1)","v":""},"SINAPI-95995",{"$error":"#REF!"},0,{"$f":"ROUND(IF(ISNUMBER(R37),R37,IF(LEFT(R37,3)=\"BDI\",HLOOKUP(R37,DADOS!$T$37:$X$38,2,FALSE),0)),15-11*$X$5)","v":0.22}]
["S",0,1,1,4,0,9,0,0,"Serviço","1.1.4.9.","SINAPI","95427","Transporte comercial com caminhão basculante  18 m³, via pavimentada DMT acima de 30Km (unidade:m³xKm). AF_09/2016 DMT=43km","m³xKm",28574.79,0.63,"BDI 1",0.77,22002.59,"ACIMA REF.",{"$f":"IF(OR($A38=0,$A38=\"S\",$A38>CFF!$A$9),\"\",MAX(V$12:OFFSET(V38,-1,0))+1)","v":""},"SINAPI-95427",{"$error":"#REF!"},0,{"$f":"ROUND(IF(ISNUMBER(R38),R38,IF(LEFT(R38,3)=\"BDI\",HLOOKUP(R38,DADOS!$T$37:$X$38,2,FALSE),0)),15-11*$X$5)","v":0.22}]
[3,7,1,1,5,0,0,19,7,"Nível 3","1.1.5.",null,null,"PASSEIOS","",null,null,"BDI 1",0,55455.65,"",{"$f":"IF(OR($A39=0,$A39=\"S\",$A39>CFF!$A$9),\"\",MAX(V$12:OFFSET(V39,-1,0))+1)","v":7},false,"X",0,{"$f":"ROUND(IF(ISNUMBER(R39),R39,IF(LEFT(R39,3)=\"BDI\",HLOOKUP(R39,DADOS!$T$37:$X$38,2,FALSE),0)),15-11*$X$5)","v":0.22}]
["S",0,1,1,5,0,1,0,0,"Serviço","1.1.5.1.","SINAPI","100576","Regularização e compactação da base","m²",843.32,2,"BDI 1",2.44,2057.6999999999998,"ACIMA REF.",{"$f":"IF(OR($A40=0,$A40=\"S\",$A40>CFF!$A$9),\"\",MAX(V$12:OFFSET(V40,-1,0))+1)","v":""},"SINAPI-100576",{"$error":"#REF!"},0,{"$f":"ROUND(IF(ISNUMBER(R40),R40,IF(LEFT(R40,3)=\"BDI\",HLOOKUP(R40,DADOS!$T$37:$X$38,2,FALSE),0)),15-11*$X$5)","v":0.22}]
["S",0,1,1,5,0,2,0,0,"Serviço","1.1.5.2.","SINAPI-I","4718","Lastro de brita - espessura 3 cm ","m³",25.29,82,"BDI 1",100.04,2530.0100000000002,"ACIMA REF.",{"$f":"IF(OR($A41=0,$A41=\"S\",$A41>CFF!$A$9),\"\",MAX(V$12:OFFSET(V41,-1,0))+1)","v":""},"SINAPI-I-4718",{"$error":"#REF!"},0,{"$f":"ROUND(IF(ISNUMBER(R41),R41,IF(LEFT(R41,3)=\"BDI\",HLOOKUP(R41,DADOS!$T$37:$X$38,2,FALSE),0)),15-11*$X$5)","v":0.22}]
["S",0,1,1,5,0,3,0,0,"Serviço","1.1.5.3.","SINAPI","94991","Execução de passeios (calçada) ou piso de concreto moldado in loco, espessura 6 cm,  usinado, acabamento convencional, não armado. AF_07/2016","m³",44.11,633.54,"BDI 1",772.92,34093.5,"ACIMA REF.",{"$f":"IF(OR($A42=0,$A42=\"S\",$A42>CFF!$A$9),\"\",MAX(V$12:OFFSET(V42,-1,0))+1)","v":""},"SINAPI-94991",{"$error":"#REF!"},0,{"$f":"ROUND(IF(ISNUMBER(R42),R42,IF(LEFT(R42,3)=\"BDI\",HLOOKUP(R42,DADOS!$T$37:$X$38,2,FALSE),0)),15-11*$X$5)","v":0.22}]
[{"$f":"CHOOSE(1+LOG(1+2*(J43=\"Meta\")+4*(J43=\"Nível 2\")+8*(J43=\"Nível 3\")+16*(J43=\"Nível 4\")+32*(J43=\"Serviço\"),2),0,1,2,3,4,\"S\")","v":"S"},{"$f":"IF(OR(A43=\"S\",A43=0),0,IF(ISERROR(I43),H43,SMALL(H43:I43,1)))","v":0},{"$f":"IF($A43=1,OFFSET(C43,-1,0)+1,OFFSET(C43,-1,0))","v":1},{"$f":"IF($A43=1,0,IF($A43=2,OFFSET(D43,-1,0)+1,OFFSET(D43,-1,0)))","v":1},{"$f":"IF(AND($A43<=2,$A43<>0),0,IF($A43=3,OFFSET(E43,-1,0)+1,OFFSET(E43,-1,0)))","v":5},{"$f":"IF(AND($A43<=3,$A43<>0),0,IF($A43=4,OFFSET(F43,-1,0)+1,OFFSET(F43,-1,0)))","v":0},{"$f":"IF(AND($A43<=4,$A43<>0),0,IF($A43=\"S\",OFFSET(G43,-1,0)+1,OFFSET(G43,-1,0)))","v":4},0,0,"Serviço",{"$f":"IF($A43=0,\"-\",CONCATENATE(C43&\".\",IF(AND($A$5>=2,$A43>=2),D43&\".\",\"\"),IF(AND($A$5>=3,$A43>=3),E43&\".\",\"\"),IF(AND($A$5>=4,$A43>=4),F43&\".\",\"\"),IF($A43=\"S\",G43&\".\",\"\")))","v":"1.1.5.4."},"SINAPI","94993","Execução de passeios (calçada) ou piso de concreto moldado in loco, espessura 6 cm, usinado, acabamento convencional, armado. AF_07/2016","m²",108,91.91,"BDI 1",{"$f":"IF($A43=\"S\",IF($Q$10=\"Preço Unitário (R$)\",PO.CustoUnitario,ROUND(PO.CustoUnitario*(1+$Z43),15-13*$X$6)),0)","v":112.13},{"$f":"IF($A43=\"S\",VTOTAL1,IF($A43=0,0,ROUND(SomaAgrup,15-13*$X$7)))","v":12110.04},{"$f":"IF($J43=\"\",\"\",IF($N43=\"\",\"DESCRIÇÃO\",IF(AND($J43=\"Serviço\",$O43=\"\"),\"UNIDADE\",IF($T43<=0,\"SEM VALOR\",IF(AND($Y43<>\"\",$Q43>$Y43),\"ACIMA REF.\",\"\")))))","v":"ACIMA REF."},{"$f":"IF(OR($A43=0,$A43=\"S\",$A43>CFF!$A$9),\"\",MAX(V$12:OFFSET(V43,-1,0))+1)","v":""},{"$f":"IF(AND($J43=\"Serviço\",$M43<>\"\"),IF($L43=\"\",$M43,CONCATENATE($L43,\"-\",$M43)))","v":"SINAPI-94993"},{"$f":"IF(AND(Fonte<>\"\",Código<>\"\"),MATCH(Fonte&\" \"&IF(Fonte=\"sinapi\",SUBSTITUTE(SUBSTITUTE(Código,\"/00\",\"/\"),\"/0\",\"/\"),Código),INDIRECT(\"'[Referência \"&_xlnm.Database&\".xls]Banco'!$a:$a\"),0),\"X\")","v":{"$error":"#REF!"}},{"$f":"IF(Import.Desoneracao=\"sim\",Referencia.Desonerado,Referencia.NaoDesonerado)","v":0},{"$f":"ROUND(IF(ISNUMBER(R43),R43,IF(LEFT(R43,3)=\"BDI\",HLOOKUP(R43,DADOS!$T$37:$X$38,2,FALSE),0)),15-11*$X$5)","v":0.22}]
["S",0,1,1,5,0,5,0,0,"Serviço","1.1.5.5.","SINAPI - I ","36178","Piso podotátil de concreto - direcional, 40 x 40 x 2,5 cm (comprimento X largura X espessura)","Unidade",360.4,9.43,"BDI 1",11.5,4144.6000000000004,"ACIMA REF.",{"$f":"IF(OR($A44=0,$A44=\"S\",$A44>CFF!$A$9),\"\",MAX(V$12:OFFSET(V44,-1,0))+1)","v":""},"SINAPI - I -36178",{"$error":"#REF!"},0,{"$f":"ROUND(IF(ISNUMBER(R44),R44,IF(LEFT(R44,3)=\"BDI\",HLOOKUP(R44,DADOS!$T$37:$X$38,2,FALSE),0)),15-11*$X$5)","v":0.22}]
["S",0,1,1,5,0,6,0,0,"Serviço","1.1.5.6.","SINAPI - I","36178","Piso podotátil de concreto - alerta, 40 x 40 x 2,5 cm (comprimento X largura X espessura)","Unidade",45.2,9.43,"BDI 1",11.5,519.79999999999995,"ACIMA REF.",{"$f":"IF(OR($A45=0,$A45=\"S\",$A45>CFF!$A$9),\"\",MAX(V$12:OFFSET(V45,-1,0))+1)","v":""},"SINAPI - I-36178",{"$error":"#REF!"},0,{"$f":"ROUND(IF(ISNUMBER(R45),R45,IF(LEFT(R45,3)=\"BDI\",HLOOKUP(R45,DADOS!$T$37:$X$38,2,FALSE),0)),15-11*$X$5)","v":0.22}]
[3,4,1,1,6,0,0,12,4,"Nível 3","1.1.6.",null,null,"MURETA DE BALISAMENTO EM CONCRETO","",null,null,"BDI 1",0,16526.330000000002,"",{"$f":"IF(OR($A46=0,$A46=\"S\",$A46>CFF!$A$9),\"\",MAX(V$12:OFFSET(V46,-1,0))+1)","v":8},false,"X",0,{"$f":"ROUND(IF(ISNUMBER(R46),R46,IF(LEFT(R46,3)=\"BDI\",HLOOKUP(R46,DADOS!$T$37:$X$38,2,FALSE),0)),15-11*$X$5)","v":0.22}]
["S",0,1,1,6,0,1,0,0,"Serviço","1.1.6.1.","SINAPI","6193","Forma em tábua 2,5 x 30 cm, em pinus, mista ou equivalente da região","m²",50,41.5,"BDI 1",50.63,2531.5,"ACIMA REF.",{"$f":"IF(OR($A47=0,$A47=\"S\",$A47>CFF!$A$9),\"\",MAX(V$12:OFFSET(V47,-1,0))+1)","v":""},"SINAPI-6193",{"$error":"#REF!"},0,{"$f":"ROUND(IF(ISNUMBER(R47),R47,IF(LEFT(R47,3)=\"BDI\",HLOOKUP(R47,DADOS!$T$37:$X$38,2,FALSE),0)),15-11*$X$5)","v":0.22}]
["S",0,1,1,6,0,2,0,0,"Serviço","1.1.6.2.","SINAPI","34492","Concreto Usinado bombeavel, classe de resistência C20, com brita 0 e 1, Slump = 130 +- 20 mm, exclui o serviço de bombeamento (NBR8953)","m³",16.7,401.13,"BDI 1",489.38,8172.65,"ACIMA REF.",{"$f":"IF(OR($A48=0,$A48=\"S\",$A48>CFF!$A$9),\"\",MAX(V$12:OFFSET(V48,-1,0))+1)","v":""},"SINAPI-34492",{"$error":"#REF!"},0,{"$f":"ROUND(IF(ISNUMBER(R48),R48,IF(LEFT(R48,3)=\"BDI\",HLOOKUP(R48,DADOS!$T$37:$X$38,2,FALSE),0)),15-11*$X$5)","v":0.22}]
["S",0,1,1,6,0,3,0,0,"Serviço","1.1.6.3.","SINAPI","42407","Treliça nervurada, altura 120 mm , diametro dos banzos inferiores e superiores 6,0 mm e diametro diagonais de 4,2 mm.","m",417.66,11.43,"BDI 1",13.94,5822.18,"ACIMA REF.",{"$f":"IF(OR($A49=0,$A49=\"S\",$A49>CFF!$A$9),\"\",MAX(V$12:OFFSET(V49,-1,0))+1)","v":""},"SINAPI-42407",{"$error":"#REF!"},0,{"$f":"ROUND(IF(ISNUMBER(R49),R49,IF(LEFT(R49,3)=\"BDI\",HLOOKUP(R49,DADOS!$T$37:$X$38,2,FALSE),0)),15-11*$X$5)","v":0.22}]
[3,6,1,1,7,0,0,8,6,"Nível 3","1.1.7.",null,null,"PINTURA E SINALIZAÇÃO","",null,null,"BDI 1",0,7327.67,"",{"$f":"IF(OR($A50=0,$A50=\"S\",$A50>CFF!$A$9),\"\",MAX(V$12:OFFSET(V50,-1,0))+1)","v":9},false,"X",0,{"$f":"ROUND(IF(ISNUMBER(R50),R50,IF(LEFT(R50,3)=\"BDI\",HLOOKUP(R50,DADOS!$T$37:$X$38,2,FALSE),0)),15-11*$X$5)","v":0.22}]
["S",0,1,1,7,0,1,0,0,"Serviço","1.1.7.1.","SINAPI","102509","Pintura de faixa de pedestre, tinta retrorefletiva a base de resina acrilica com micro esferas devidro, aplicação manual. AF_05/2021","m²",110.26,22.48,"BDI 1",27.43,3024.43,"ACIMA REF.",{"$f":"IF(OR($A51=0,$A51=\"S\",$A51>CFF!$A$9),\"\",MAX(V$12:OFFSET(V51,-1,0))+1)","v":""},"SINAPI-102509",{"$error":"#REF!"},0,{"$f":"ROUND(IF(ISNUMBER(R51),R51,IF(LEFT(R51,3)=\"BDI\",HLOOKUP(R51,DADOS!$T$37:$X$38,2,FALSE),0)),15-11*$X$5)","v":0.22}]
[{"$f":"CHOOSE(1+LOG(1+2*(J52=\"Meta\")+4*(J52=\"Nível 2\")+8*(J52=\"Nível 3\")+16*(J52=\"Nível 4\")+32*(J52=\"Serviço\"),2),0,1,2,3,4,\"S\")","v":"S"},{"$f":"IF(OR(A52=\"S\",A52=0),0,IF(ISERROR(I52),H52,SMALL(H52:I52,1)))","v":0},{"$f":"IF($A52=1,OFFSET(C52,-1,0)+1,OFFSET(C52,-1,0))","v":1},{"$f":"IF($A52=1,0,IF($A52=2,OFFSET(D52,-1,0)+1,OFFSET(D52,-1,0)))","v":1},{"$f":"IF(AND($A52<=2,$A52<>0),0,IF($A52=3,OFFSET(E52,-1,0)+1,OFFSET(E52,-1,0)))","v":7},{"$f":"IF(AND($A52<=3,$A52<>0),0,IF($A52=4,OFFSET(F52,-1,0)+1,OFFSET(F52,-1,0)))","v":0},{"$f":"IF(AND($A52<=4,$A52<>0),0,IF($A52=\"S\",OFFSET(G52,-1,0)+1,OFFSET(G52,-1,0)))","v":2},0,0,"Serviço",{"$f":"IF($A52=0,\"-\",CONCATENATE(C52&\".\",IF(AND($A$5>=2,$A52>=2),D52&\".\",\"\"),IF(AND($A$5>=3,$A52>=3),E52&\".\",\"\"),IF(AND($A$5>=4,$A52>=4),F52&\".\",\"\"),IF($A52=\"S\",G52&\".\",\"\")))","v":"1.1.7.2."},"SINAPI ","102512","Pintura de eixo viário, com tinta retrorefletiva a base de resina acrilica com micro esferas de vidro, aplicação macanica com emarcadora autopropelida. AF_05/2021","m",596.66,4.01,"BDI 1",{"$f":"IF($A52=\"S\",IF($Q$10=\"Preço Unitário (R$)\",PO.CustoUnitario,ROUND(PO.CustoUnitario*(1+$Z52),15-13*$X$6)),0)","v":4.8899999999999997},{"$f":"IF($A52=\"S\",VTOTAL1,IF($A52=0,0,ROUND(SomaAgrup,15-13*$X$7)))","v":2917.67},{"$f":"IF($J52=\"\",\"\",IF($N52=\"\",\"DESCRIÇÃO\",IF(AND($J52=\"Serviço\",$O52=\"\"),\"UNIDADE\",IF($T52<=0,\"SEM VALOR\",IF(AND($Y52<>\"\",$Q52>$Y52),\"ACIMA REF.\",\"\")))))","v":"ACIMA REF."},{"$f":"IF(OR($A52=0,$A52=\"S\",$A52>CFF!$A$9),\"\",MAX(V$12:OFFSET(V52,-1,0))+1)","v":""},{"$f":"IF(AND($J52=\"Serviço\",$M52<>\"\"),IF($L52=\"\",$M52,CONCATENATE($L52,\"-\",$M52)))","v":"SINAPI -102512"},{"$f":"IF(AND(Fonte<>\"\",Código<>\"\"),MATCH(Fonte&\" \"&IF(Fonte=\"sinapi\",SUBSTITUTE(SUBSTITUTE(Código,\"/00\",\"/\"),\"/0\",\"/\"),Código),INDIRECT(\"'[Referência \"&_xlnm.Database&\".xls]Banco'!$a:$a\"),0),\"X\")","v":{"$error":"#REF!"}},{"$f":"IF(Import.Desoneracao=\"sim\",Referencia.Desonerado,Referencia.NaoDesonerado)","v":0},{"$f":"ROUND(IF(ISNUMBER(R52),R52,IF(LEFT(R52,3)=\"BDI\",HLOOKUP(R52,DADOS!$T$37:$X$38,2,FALSE),0)),15-11*$X$5)","v":0.22}]
[{"$f":"CHOOSE(1+LOG(1+2*(J53=\"Meta\")+4*(J53=\"Nível 2\")+8*(J53=\"Nível 3\")+16*(J53=\"Nível 4\")+32*(J53=\"Serviço\"),2),0,1,2,3,4,\"S\")","v":"S"},{"$f":"IF(OR(A53=\"S\",A53=0),0,IF(ISERROR(I53),H53,SMALL(H53:I53,1)))","v":0},{"$f":"IF($A53=1,OFFSET(C53,-1,0)+1,OFFSET(C53,-1,0))","v":1},{"$f":"IF($A53=1,0,IF($A53=2,OFFSET(D53,-1,0)+1,OFFSET(D53,-1,0)))","v":1},{"$f":"IF(AND($A53<=2,$A53<>0),0,IF($A53=3,OFFSET(E53,-1,0)+1,OFFSET(E53,-1,0)))","v":7},{"$f":"IF(AND($A53<=3,$A53<>0),0,IF($A53=4,OFFSET(F53,-1,0)+1,OFFSET(F53,-1,0)))","v":0},{"$f":"IF(AND($A53<=4,$A53<>0),0,IF($A53=\"S\",OFFSET(G53,-1,0)+1,OFFSET(G53,-1,0)))","v":3},0,0,"Serviço",{"$f":"IF($A53=0,\"-\",CONCATENATE(C53&\".\",IF(AND($A$5>=2,$A53>=2),D53&\".\",\"\"),IF(AND($A$5>=3,$A53>=3),E53&\".\",\"\"),IF(AND($A$5>=4,$A53>=4),F53&\".\",\"\"),IF($A53=\"S\",G53&\".\",\"\")))","v":"1.1.7.3."},"SINAPI - I","13521","Placa de aço esmaltada para a identificação de Rua 45 cm x 20 cm ","und",2,74.25,"BDI 1",{"$f":"IF($A53=\"S\",IF($Q$10=\"Preço Unitário (R$)\",PO.CustoUnitario,ROUND(PO.CustoUnitario*(1+$Z53),15-13*$X$6)),0)","v":90.59},{"$f":"IF($A53=\"S\",VTOTAL1,IF($A53=0,0,ROUND(SomaAgrup,15-13*$X$7)))","v":181.18},{"$f":"IF($J53=\"\",\"\",IF($N53=\"\",\"DESCRIÇÃO\",IF(AND($J53=\"Serviço\",$O53=\"\"),\"UNIDADE\",IF($T53<=0,\"SEM VALOR\",IF(AND($Y53<>\"\",$Q53>$Y53),\"ACIMA REF.\",\"\")))))","v":"ACIMA REF."},{"$f":"IF(OR($A53=0,$A53=\"S\",$A53>CFF!$A$9),\"\",MAX(V$12:OFFSET(V53,-1,0))+1)","v":""},{"$f":"IF(AND($J53=\"Serviço\",$M53<>\"\"),IF($L53=\"\",$M53,CONCATENATE($L53,\"-\",$M53)))","v":"SINAPI - I-13521"},{"$f":"IF(AND(Fonte<>\"\",Código<>\"\"),MATCH(Fonte&\" \"&IF(Fonte=\"sinapi\",SUBSTITUTE(SUBSTITUTE(Código,\"/00\",\"/\"),\"/0\",\"/\"),Código),INDIRECT(\"'[Referência \"&_xlnm.Database&\".xls]Banco'!$a:$a\"),0),\"X\")","v":{"$error":"#REF!"}},{"$f":"IF(Import.Desoneracao=\"sim\",Referencia.Desonerado,Referencia.NaoDesonerado)","v":0},{"$f":"ROUND(IF(ISNUMBER(R53),R53,IF(LEFT(R53,3)=\"BDI\",HLOOKUP(R53,DADOS!$T$37:$X$38,2,FALSE),0)),15-11*$X$5)","v":0.22}]
["S",0,1,1,7,0,4,0,0,"Serviço","1.1.7.4.","SINAPI","34723","Plaça de sinalização em chapa de aço tot. pintura refletiva","m²",0.5,519.75,"BDI 1",634.1,317.05,"ACIMA REF.",{"$f":"IF(OR($A54=0,$A54=\"S\",$A54>CFF!$A$9),\"\",MAX(V$12:OFFSET(V54,-1,0))+1)","v":""},"SINAPI-34723",{"$error":"#REF!"},0,{"$f":"ROUND(IF(ISNUMBER(R54),R54,IF(LEFT(R54,3)=\"BDI\",HLOOKUP(R54,DADOS!$T$37:$X$38,2,FALSE),0)),15-11*$X$5)","v":0.22}]
["S",0,1,1,7,0,5,0,0,"Serviço","1.1.7.5.","SINAPI - I","21014","Tubo de aço galvanizado c/ costura DN 2 1/2\" (65mm), E=3,35 mm ","m",6,121.22,"BDI 1",147.88999999999999,887.34,"ACIMA REF.",{"$f":"IF(OR($A55=0,$A55=\"S\",$A55>CFF!$A$9),\"\",MAX(V$12:OFFSET(V55,-1,0))+1)","v":""},"SINAPI - I-21014",{"$error":"#REF!"},0,{"$f":"ROUND(IF(ISNUMBER(R55),R55,IF(LEFT(R55,3)=\"BDI\",HLOOKUP(R55,DADOS!$T$37:$X$38,2,FALSE),0)),15-11*$X$5)","v":0.22}]
[3,2,1,1,8,0,0,2,{"$error":"#N/A"},"Nível 3","1.1.8.",null,null,"SERVIÇOS COMPLEMENTARES - LIMPEZA FINAL DA OBRA","",null,null,"BDI 1",0,1619.5,"",{"$f":"IF(OR($A56=0,$A56=\"S\",$A56>CFF!$A$9),\"\",MAX(V$12:OFFSET(V56,-1,0))+1)","v":10},false,"X",0,{"$f":"ROUND(IF(ISNUMBER(R56),R56,IF(LEFT(R56,3)=\"BDI\",HLOOKUP(R56,DADOS!$T$37:$X$38,2,FALSE),0)),15-11*$X$5)","v":0.22}]
["S",0,1,1,8,0,1,0,0,"Serviço","1.1.8.1.","SINAPI - I ","5901","Caminhão Pipa 10.000L, peso bruto total de 23.000 kg, inclusive tanque de aço para o transporte de água, capacidade de 10 m³","h",5,265.49,"BDI 1",323.89999999999998,1619.5,"ACIMA REF.",{"$f":"IF(OR($A57=0,$A57=\"S\",$A57>CFF!$A$9),\"\",MAX(V$12:OFFSET(V57,-1,0))+1)","v":""},"SINAPI - I -5901",{"$error":"#REF!"},0,{"$f":"ROUND(IF(ISNUMBER(R57),R57,IF(LEFT(R57,3)=\"BDI\",HLOOKUP(R57,DADOS!$T$37:$X$38,2,FALSE),0)),15-11*$X$5)","v":0.22}]
[-1,null,0,0,0,0,0]
[null,null,null,null,null,null,null,null,null,null,"Encargos sociais:",null,"Para elaboração deste orçamento, foram utilizados os encargos sociais do SINAPI para a Unidade da Federação indicada."]
[]
[null,null,null,null,null,null,null,null,null,null,"Observações:"]
[]
[]
[]
[]
[null,null,null,null,null,null,null,null,null,null,{"$f":"IF(AND($X$3=FALSE,$X$4=FALSE,$X$5=FALSE,$X$6=FALSE,$X$7=FALSE),\"Não foi considerado arredondamento nos valores da planilha.\",CONCATENATE(\"Foi considerado arredondamento de duas casas decimais para \",IF($X$3=TRUE,\"Quantidade; \",\"\"),IF($X$4=TRUE,\"Custo Unitário; \",\"\"),IF($X$5=TRUE,\"BDI; \",\"\"),IF($X$6=TRUE,\"Preço Unitário; \",\"\"),IF($X$7=TRUE,\"Preço Total.\",\"\")))","v":"Foi considerado arredondamento de duas casas decimais para Quantidade; Custo Unitário; BDI; Preço Unitário; Preço Total."}]
[]
[]
[null,null,null,null,null,null,null,null,null,null,{"$f":"Import.Município","v":"Tunápolis/SC"}]
[null,null,null,null,null,null,null,null,null,null,"Local"]
[]
[null,null,null,null,null,null,null,null,null,null,{"$f":"TODAY()","v":"2022-04-11"}]
[null,null,null,null,null,null,null,null,null,null,"Data"]

{"sheet":"PLQ","index":3,"n_rows":64,"n_cols":21,"rows_kept":64,"cut":false,"hidden":true,"merged":[[59,1,59,2],[62,1,62,2]]}
[null,null,null,null,"PLQ -","PLANILHA DE LEVANTAMENTO DE QUANTIDADES"]
[]
[]
[]
[]
[]
[null,null,null,null,{"$f":"OFFSET(PO!$P$12,ROW($E7)-ROW(E$12),0)","v":0}]
[]
[null,null,null,null,"-","Única"]
["Nível","Item","Descrição","Unid.","Quantidade",{"$f":"IF(OFFSET(F10,0,-1)=\"Quantidade\",1,OFFSET(F10,0,-1)+1)","v":1},2,3,4,5,6,7,8,9,10,null,null,null,null,null,{"$f":"IF(OFFSET(U10,0,-1)=\"Quantidade\",1,OFFSET(U10,0,-1)+1)","v":1}]
[{"$f":"OFFSET(PO!J$12,ROW(A11)-ROW($A$12),0)","v":"Serviço"},{"$f":"IF($A11=0,\"\",OFFSET(PO!K$12,ROW(B11)-ROW(B$12),0))","v":{"$error":"#VALUE!"}},{"$f":"IF(OFFSET(PO!N$12,ROW(C11)-ROW(C$12),0)=0,\"\",OFFSET(PO!N$12,ROW(C11)-ROW(C$12),0))","v":""},{"$f":"IF(OFFSET(PO!O$12,ROW(D11)-ROW(D$12),0)=0,\"\",OFFSET(PO!O$12,ROW(D11)-ROW(D$12),0))","v":""},{"$f":"IF($A11<>\"Serviço\",0,ROUND(SUMIF($F$9:$P$9,\"<>\",$F11:$P11),15-13*PO!$X$3))","v":0},{"$f":"OFFSET(PO!$P$12,ROW($E11)-ROW(F$12),0)","v":0}]
[{"$f":"PO!J12","v":"LOTE"},null,{"$f":"PO!N12","v":0}]
[{"$f":"OFFSET(PO!J$12,ROW(A13)-ROW($A$12),0)","v":"Meta"},{"$f":"IF($A13=0,\"\",OFFSET(PO!K$12,ROW(B13)-ROW(B$12),0))","v":"1."},{"$f":"IF(OFFSET(PO!N$12,ROW(C13)-ROW(C$12),0)=0,\"\",OFFSET(PO!N$12,ROW(C13)-ROW(C$12),0))","v":"PAVIMENTAÇÃO ASFÁLTICA"},{"$f":"IF(OFFSET(PO!O$12,ROW(D13)-ROW(D$12),0)=0,\"\",OFFSET(PO!O$12,ROW(D13)-ROW(D$12),0))","v":""},{"$f":"IF($A13<>\"Serviço\",0,ROUND(SUMIF($F$9:$P$9,\"<>\",$F13:$P13),15-13*PO!$X$3))","v":0},0]
[{"$f":"OFFSET(PO!J$12,ROW(A14)-ROW($A$12),0)","v":"Nível 2"},{"$f":"IF($A14=0,\"\",OFFSET(PO!K$12,ROW(B14)-ROW(B$12),0))","v":"1.1."},{"$f":"IF(OFFSET(PO!N$12,ROW(C14)-ROW(C$12),0)=0,\"\",OFFSET(PO!N$12,ROW(C14)-ROW(C$12),0))","v":"RUAS FELIPE ARSÊNIO BAMBERG E AMELDA TEREZA BIEGER "},{"$f":"IF(OFFSET(PO!O$12,ROW(D14)-ROW(D$12),0)=0,\"\",OFFSET(PO!O$12,ROW(D14)-ROW(D$12),0))","v":""},{"$f":"IF($A14<>\"Serviço\",0,ROUND(SUMIF($F$9:$P$9,\"<>\",$F14:$P14),15-13*PO!$X$3))","v":0},0]
[{"$f":"OFFSET(PO!J$12,ROW(A15)-ROW($A$12),0)","v":"Nível 3"},{"$f":"IF($A15=0,\"\",OFFSET(PO!K$12,ROW(B15)-ROW(B$12),0))","v":"1.1.1."},{"$f":"IF(OFFSET(PO!N$12,ROW(C15)-ROW(C$12),0)=0,\"\",OFFSET(PO!N$12,ROW(C15)-ROW(C$12),0))","v":"SERVIÇOS PRELIMINARES "},{"$f":"IF(OFFSET(PO!O$12,ROW(D15)-ROW(D$12),0)=0,\"\",OFFSET(PO!O$12,ROW(D15)-ROW(D$12),0))","v":""},{"$f":"IF($A15<>\"Serviço\",0,ROUND(SUMIF($F$9:$P$9,\"<>\",$F15:$P15),15-13*PO!$X$3))","v":0},0]
[{"$f":"OFFSET(PO!J$12,ROW(A16)-ROW($A$12),0)","v":"Serviço"},{"$f":"IF($A16=0,\"\",OFFSET(PO!K$12,ROW(B16)-ROW(B$12),0))","v":"1.1.1.1."},{"$f":"IF(OFFSET(PO!N$12,ROW(C16)-ROW(C$12),0)=0,\"\",OFFSET(PO!N$12,ROW(C16)-ROW(C$12),0))","v":"Placa de obra (construção civil) em chapa de aço galvanizado, nº22, adesivada."},{"$f":"IF(OFFSET(PO!O$12,ROW(D16)-ROW(D$12),0)=0,\"\",OFFSET(PO!O$12,ROW(D16)-ROW(D$12),0))","v":"m²"},{"$f":"IF($A16<>\"Serviço\",0,ROUND(SUMIF($F$9:$P$9,\"<>\",$F16:$P16),15-13*PO!$X$3))","v":2.5},2.5]
[{"$f":"OFFSET(PO!J$12,ROW(A17)-ROW($A$12),0)","v":"Serviço"},{"$f":"IF($A17=0,\"\",OFFSET(PO!K$12,ROW(B17)-ROW(B$12),0))","v":"1.1.1.2."},{"$f":"IF(OFFSET(PO!N$12,ROW(C17)-ROW(C$12),0)=0,\"\",OFFSET(PO!N$12,ROW(C17)-ROW(C$12),0))","v":"Encarregado geral de obra "},{"$f":"IF(OFFSET(PO!O$12,ROW(D17)-ROW(D$12),0)=0,\"\",OFFSET(PO!O$12,ROW(D17)-ROW(D$12),0))","v":"h"},{"$f":"IF($A17<>\"Serviço\",0,ROUND(SUMIF($F$9:$P$9,\"<>\",$F17:$P17),15-13*PO!$X$3))","v":60},60]
[{"$f":"OFFSET(PO!J$12,ROW(A18)-ROW($A$12),0)","v":"Serviço"},{"$f":"IF($A18=0,\"\",OFFSET(PO!K$12,ROW(B18)-ROW(B$12),0))","v":"1.1.1.3."},{"$f":"IF(OFFSET(PO!N$12,ROW(C18)-ROW(C$12),0)=0,\"\",OFFSET(PO!N$12,ROW(C18)-ROW(C$12),0))","v":"Engenheiro civil "},{"$f":"IF(OFFSET(PO!O$12,ROW(D18)-ROW(D$12),0)=0,\"\",OFFSET(PO!O$12,ROW(D18)-ROW(D$12),0))","v":"h"},{"$f":"IF($A18<>\"Serviço\",0,ROUND(SUMIF($F$9:$P$9,\"<>\",$F18:$P18),15-13*PO!$X$3))","v":15},{"$f":"OFFSET(PO!$P$12,ROW($E18)-ROW(F$12),0)","v":15}]
[{"$f":"OFFSET(PO!J$12,ROW(A19)-ROW($A$12),0)","v":"Serviço"},{"$f":"IF($A19=0,\"\",OFFSET(PO!K$12,ROW(B19)-ROW(B$12),0))","v":"1.1.1.4."},{"$f":"IF(OFFSET(PO!N$12,ROW(C19)-ROW(C$12),0)=0,\"\",OFFSET(PO!N$12,ROW(C19)-ROW(C$12),0))","v":"Topográfo para a marcação planialtimetrica da pavimentação "},{"$f":"IF(OFFSET(PO!O$12,ROW(D19)-ROW(D$12),0)=0,\"\",OFFSET(PO!O$12,ROW(D19)-ROW(D$12),0))","v":"h"},{"$f":"IF($A19<>\"Serviço\",0,ROUND(SUMIF($F$9:$P$9,\"<>\",$F19:$P19),15-13*PO!$X$3))","v":0},0]
[{"$f":"OFFSET(PO!J$12,ROW(A20)-ROW($A$12),0)","v":"Nível 3"},{"$f":"IF($A20=0,\"\",OFFSET(PO!K$12,ROW(B20)-ROW(B$12),0))","v":"1.1.2."},{"$f":"IF(OFFSET(PO!N$12,ROW(C20)-ROW(C$12),0)=0,\"\",OFFSET(PO!N$12,ROW(C20)-ROW(C$12),0))","v":"DRENAGEM E RECOMPOSIÇÃO DE PAVIMENTO "},{"$f":"IF(OFFSET(PO!O$12,ROW(D20)-ROW(D$12),0)=0,\"\",OFFSET(PO!O$12,ROW(D20)-ROW(D$12),0))","v":""},{"$f":"IF($A20<>\"Serviço\",0,ROUND(SUMIF($F$9:$P$9,\"<>\",$F20:$P20),15-13*PO!$X$3))","v":0},0]
[{"$f":"OFFSET(PO!J$12,ROW(A21)-ROW($A$12),0)","v":"Serviço"},{"$f":"IF($A21=0,\"\",OFFSET(PO!K$12,ROW(B21)-ROW(B$12),0))","v":"1.1.2.1."},{"$f":"IF(OFFSET(PO!N$12,ROW(C21)-ROW(C$12),0)=0,\"\",OFFSET(PO!N$12,ROW(C21)-ROW(C$12),0))","v":"Escavação mecanizada de vala com profundidade até 1,5m, escavadeira hidraulica (0,8 m³), largura de 1,5 m até 2,5 m, locais cm baixo nivel de interferência. AF_02/2021"},{"$f":"IF(OFFSET(PO!O$12,ROW(D21)-ROW(D$12),0)=0,\"\",OFFSET(PO!O$12,ROW(D21)-ROW(D$12),0))","v":"m³"},{"$f":"IF($A21<>\"Serviço\",0,ROUND(SUMIF($F$9:$P$9,\"<>\",$F21:$P21),15-13*PO!$X$3))","v":0},0]
[{"$f":"OFFSET(PO!J$12,ROW(A22)-ROW($A$12),0)","v":"Serviço"},{"$f":"IF($A22=0,\"\",OFFSET(PO!K$12,ROW(B22)-ROW(B$12),0))","v":"1.1.2.2."},{"$f":"IF(OFFSET(PO!N$12,ROW(C22)-ROW(C$12),0)=0,\"\",OFFSET(PO!N$12,ROW(C22)-ROW(C$12),0))","v":"Desmonte de material de 3ª categoria (blocos de rochas ou matações) com martelete pneumatico hidráulico. Exclusive carga e transporte. AF_03/2021"},{"$f":"IF(OFFSET(PO!O$12,ROW(D22)-ROW(D$12),0)=0,\"\",OFFSET(PO!O$12,ROW(D22)-ROW(D$12),0))","v":"m³"},{"$f":"IF($A22<>\"Serviço\",0,ROUND(SUMIF($F$9:$P$9,\"<>\",$F22:$P22),15-13*PO!$X$3))","v":0},0]
[{"$f":"OFFSET(PO!J$12,ROW(A23)-ROW($A$12),0)","v":"Serviço"},{"$f":"IF($A23=0,\"\",OFFSET(PO!K$12,ROW(B23)-ROW(B$12),0))","v":"1.1.2.3."},{"$f":"IF(OFFSET(PO!N$12,ROW(C23)-ROW(C$12),0)=0,\"\",OFFSET(PO!N$12,ROW(C23)-ROW(C$12),0))","v":"Tubo de concreto para redes coletoras de águas pluviais, diâmetro de 400 mm, junta rigida, instalado em local de com baixo nivel de interferência - fornecimento e assentamento. AF_12/2015"},{"$f":"IF(OFFSET(PO!O$12,ROW(D23)-ROW(D$12),0)=0,\"\",OFFSET(PO!O$12,ROW(D23)-ROW(D$12),0))","v":"m"},{"$f":"IF($A23<>\"Serviço\",0,ROUND(SUMIF($F$9:$P$9,\"<>\",$F23:$P23),15-13*PO!$X$3))","v":0},0]
[{"$f":"OFFSET(PO!J$12,ROW(A24)-ROW($A$12),0)","v":"Serviço"},{"$f":"IF($A24=0,\"\",OFFSET(PO!K$12,ROW(B24)-ROW(B$12),0))","v":"1.1.2.4."},{"$f":"IF(OFFSET(PO!N$12,ROW(C24)-ROW(C$12),0)=0,\"\",OFFSET(PO!N$12,ROW(C24)-ROW(C$12),0))","v":"Tubo de concreto para redes coletoras de águas pluviais, diâmetro de 600 mm, junta rígida, instalado em loacal com baixo nivel de interferência - fornecimento e assentamento. AF_12/2015"},{"$f":"IF(OFFSET(PO!O$12,ROW(D24)-ROW(D$12),0)=0,\"\",OFFSET(PO!O$12,ROW(D24)-ROW(D$12),0))","v":"m"},{"$f":"IF($A24<>\"Serviço\",0,ROUND(SUMIF($F$9:$P$9,\"<>\",$F24:$P24),15-13*PO!$X$3))","v":0},0]
[{"$f":"OFFSET(PO!J$12,ROW(A25)-ROW($A$12),0)","v":"Serviço"},{"$f":"IF($A25=0,\"\",OFFSET(PO!K$12,ROW(B25)-ROW(B$12),0))","v":"1.1.2.5."},{"$f":"IF(OFFSET(PO!N$12,ROW(C25)-ROW(C$12),0)=0,\"\",OFFSET(PO!N$12,ROW(C25)-ROW(C$12),0))","v":"Caixa com grelha para boca de lobo simples retangular, em concreto pré moldado, dimensões 0,6x1,0x1,0 m. AF_12/2020"},{"$f":"IF(OFFSET(PO!O$12,ROW(D25)-ROW(D$12),0)=0,\"\",OFFSET(PO!O$12,ROW(D25)-ROW(D$12),0))","v":"Unidade"},{"$f":"IF($A25<>\"Serviço\",0,ROUND(SUMIF($F$9:$P$9,\"<>\",$F25:$P25),15-13*PO!$X$3))","v":0},0]
[{"$f":"OFFSET(PO!J$12,ROW(A26)-ROW($A$12),0)","v":"Serviço"},{"$f":"IF($A26=0,\"\",OFFSET(PO!K$12,ROW(B26)-ROW(B$12),0))","v":"1.1.2.6."},{"$f":"IF(OFFSET(PO!N$12,ROW(C26)-ROW(C$12),0)=0,\"\",OFFSET(PO!N$12,ROW(C26)-ROW(C$12),0))","v":"Reaterro e compactação de vala."},{"$f":"IF(OFFSET(PO!O$12,ROW(D26)-ROW(D$12),0)=0,\"\",OFFSET(PO!O$12,ROW(D26)-ROW(D$12),0))","v":"m³"},{"$f":"IF($A26<>\"Serviço\",0,ROUND(SUMIF($F$9:$P$9,\"<>\",$F26:$P26),15-13*PO!$X$3))","v":0},0]
[{"$f":"OFFSET(PO!J$12,ROW(A27)-ROW($A$12),0)","v":"Nível 3"},{"$f":"IF($A27=0,\"\",OFFSET(PO!K$12,ROW(B27)-ROW(B$12),0))","v":"1.1.3."},{"$f":"IF(OFFSET(PO!N$12,ROW(C27)-ROW(C$12),0)=0,\"\",OFFSET(PO!N$12,ROW(C27)-ROW(C$12),0))","v":"MEIOS - FIOS "},{"$f":"IF(OFFSET(PO!O$12,ROW(D27)-ROW(D$12),0)=0,\"\",OFFSET(PO!O$12,ROW(D27)-ROW(D$12),0))","v":""},{"$f":"IF($A27<>\"Serviço\",0,ROUND(SUMIF($F$9:$P$9,\"<>\",$F27:$P27),15-13*PO!$X$3))","v":0},0]
[{"$f":"OFFSET(PO!J$12,ROW(A28)-ROW($A$12),0)","v":"Serviço"},{"$f":"IF($A28=0,\"\",OFFSET(PO!K$12,ROW(B28)-ROW(B$12),0))","v":"1.1.3.1."},{"$f":"IF(OFFSET(PO!N$12,ROW(C28)-ROW(C$12),0)=0,\"\",OFFSET(PO!N$12,ROW(C28)-ROW(C$12),0))","v":"Assentamento de guia (meio-fio) em trecho reto, confecionada em  concreto pré fabricado, dimensões (100X15X13X30) cm, (comprimento X base inferior X base superior X altura), para vias urbanas. (uso viário). AF_06/2016  "},{"$f":"IF(OFFSET(PO!O$12,ROW(D28)-ROW(D$12),0)=0,\"\",OFFSET(PO!O$12,ROW(D28)-ROW(D$12),0))","v":"m"},{"$f":"IF($A28<>\"Serviço\",0,ROUND(SUMIF($F$9:$P$9,\"<>\",$F28:$P28),15-13*PO!$X$3))","v":0},0]
[{"$f":"OFFSET(PO!J$12,ROW(A29)-ROW($A$12),0)","v":"Nível 3"},{"$f":"IF($A29=0,\"\",OFFSET(PO!K$12,ROW(B29)-ROW(B$12),0))","v":"1.1.4."},{"$f":"IF(OFFSET(PO!N$12,ROW(C29)-ROW(C$12),0)=0,\"\",OFFSET(PO!N$12,ROW(C29)-ROW(C$12),0))","v":"PAVIMENTAÇÃO ASFÁLTICA SOBRE LEITO NATURAL"},{"$f":"IF(OFFSET(PO!O$12,ROW(D29)-ROW(D$12),0)=0,\"\",OFFSET(PO!O$12,ROW(D29)-ROW(D$12),0))","v":""},{"$f":"IF($A29<>\"Serviço\",0,ROUND(SUMIF($F$9:$P$9,\"<>\",$F29:$P29),15-13*PO!$X$3))","v":0},0]
[{"$f":"OFFSET(PO!J$12,ROW(A30)-ROW($A$12),0)","v":"Serviço"},{"$f":"IF($A30=0,\"\",OFFSET(PO!K$12,ROW(B30)-ROW(B$12),0))","v":"1.1.4.1."},{"$f":"IF(OFFSET(PO!N$12,ROW(C30)-ROW(C$12),0)=0,\"\",OFFSET(PO!N$12,ROW(C30)-ROW(C$12),0))","v":"Escavação horizontal em solo de 1ª categoria com trator de esteiras (170 hp/lamina: 5,20 m³). AF_07/202"},{"$f":"IF(OFFSET(PO!O$12,ROW(D30)-ROW(D$12),0)=0,\"\",OFFSET(PO!O$12,ROW(D30)-ROW(D$12),0))","v":"m³"},{"$f":"IF($A30<>\"Serviço\",0,ROUND(SUMIF($F$9:$P$9,\"<>\",$F30:$P30),15-13*PO!$X$3))","v":0},0]
[{"$f":"OFFSET(PO!J$12,ROW(A31)-ROW($A$12),0)","v":"Serviço"},{"$f":"IF($A31=0,\"\",OFFSET(PO!K$12,ROW(B31)-ROW(B$12),0))","v":"1.1.4.2."},{"$f":"IF(OFFSET(PO!N$12,ROW(C31)-ROW(C$12),0)=0,\"\",OFFSET(PO!N$12,ROW(C31)-ROW(C$12),0))","v":"Execução e compactação de aterro com solo predominantemente argiloso - exclusive escavação, carga e trasnporte e solo AF_09/2017"},{"$f":"IF(OFFSET(PO!O$12,ROW(D31)-ROW(D$12),0)=0,\"\",OFFSET(PO!O$12,ROW(D31)-ROW(D$12),0))","v":"m³"},{"$f":"IF($A31<>\"Serviço\",0,ROUND(SUMIF($F$9:$P$9,\"<>\",$F31:$P31),15-13*PO!$X$3))","v":294.95},294.95]
[{"$f":"OFFSET(PO!J$12,ROW(A32)-ROW($A$12),0)","v":"Serviço"},{"$f":"IF($A32=0,\"\",OFFSET(PO!K$12,ROW(B32)-ROW(B$12),0))","v":"1.1.4.3."},{"$f":"IF(OFFSET(PO!N$12,ROW(C32)-ROW(C$12),0)=0,\"\",OFFSET(PO!N$12,ROW(C32)-ROW(C$12),0))","v":"Regularização e compactação do subleito de solo predominantemente argiloso. AF_11/2019"},{"$f":"IF(OFFSET(PO!O$12,ROW(D32)-ROW(D$12),0)=0,\"\",OFFSET(PO!O$12,ROW(D32)-ROW(D$12),0))","v":"m²"},{"$f":"IF($A32<>\"Serviço\",0,ROUND(SUMIF($F$9:$P$9,\"<>\",$F32:$P32),15-13*PO!$X$3))","v":0},0]
[{"$f":"OFFSET(PO!J$12,ROW(A33)-ROW($A$12),0)","v":"Serviço"},{"$f":"IF($A33=0,\"\",OFFSET(PO!K$12,ROW(B33)-ROW(B$12),0))","v":"1.1.4.4."},{"$f":"IF(OFFSET(PO!N$12,ROW(C33)-ROW(C$12),0)=0,\"\",OFFSET(PO!N$12,ROW(C33)-ROW(C$12),0))","v":"Execução e Compactação de base ou sub base em macadame -  exclusive escavação, carga e transporte - AF_09/2017 - espessura 18cm   "},{"$f":"IF(OFFSET(PO!O$12,ROW(D33)-ROW(D$12),0)=0,\"\",OFFSET(PO!O$12,ROW(D33)-ROW(D$12),0))","v":"m³"},{"$f":"IF($A33<>\"Serviço\",0,ROUND(SUMIF($F$9:$P$9,\"<>\",$F33:$P33),15-13*PO!$X$3))","v":0},0]
[{"$f":"OFFSET(PO!J$12,ROW(A34)-ROW($A$12),0)","v":"Serviço"},{"$f":"IF($A34=0,\"\",OFFSET(PO!K$12,ROW(B34)-ROW(B$12),0))","v":"1.1.4.5."},{"$f":"IF(OFFSET(PO!N$12,ROW(C34)-ROW(C$12),0)=0,\"\",OFFSET(PO!N$12,ROW(C34)-ROW(C$12),0))","v":"Execução e Compactação de base e ou sub base com com brita graduada simples (BGS) - exclusive carga e transporte AF_09/2017- espessura 12 cm "},{"$f":"IF(OFFSET(PO!O$12,ROW(D34)-ROW(D$12),0)=0,\"\",OFFSET(PO!O$12,ROW(D34)-ROW(D$12),0))","v":"m³"},{"$f":"IF($A34<>\"Serviço\",0,ROUND(SUMIF($F$9:$P$9,\"<>\",$F34:$P34),15-13*PO!$X$3))","v":0},0]
[{"$f":"OFFSET(PO!J$12,ROW(A35)-ROW($A$12),0)","v":"Serviço"},{"$f":"IF($A35=0,\"\",OFFSET(PO!K$12,ROW(B35)-ROW(B$12),0))","v":"1.1.4.6."},{"$f":"IF(OFFSET(PO!N$12,ROW(C35)-ROW(C$12),0)=0,\"\",OFFSET(PO!N$12,ROW(C35)-ROW(C$12),0))","v":"Imprimação de base de pavimentação com com asfalto diluido imprimação. Taxa de aplicação de 1,2 L/m²."},{"$f":"IF(OFFSET(PO!O$12,ROW(D35)-ROW(D$12),0)=0,\"\",OFFSET(PO!O$12,ROW(D35)-ROW(D$12),0))","v":"m²"},{"$f":"IF($A35<>\"Serviço\",0,ROUND(SUMIF($F$9:$P$9,\"<>\",$F35:$P35),15-13*PO!$X$3))","v":0},0]
[{"$f":"OFFSET(PO!J$12,ROW(A36)-ROW($A$12),0)","v":"Serviço"},{"$f":"IF($A36=0,\"\",OFFSET(PO!K$12,ROW(B36)-ROW(B$12),0))","v":"1.1.4.7."},{"$f":"IF(OFFSET(PO!N$12,ROW(C36)-ROW(C$12),0)=0,\"\",OFFSET(PO!N$12,ROW(C36)-ROW(C$12),0))","v":"Pintura de Ligação com emulsão  RR-2C  taxa de 0,60 L/m²"},{"$f":"IF(OFFSET(PO!O$12,ROW(D36)-ROW(D$12),0)=0,\"\",OFFSET(PO!O$12,ROW(D36)-ROW(D$12),0))","v":"m²"},{"$f":"IF($A36<>\"Serviço\",0,ROUND(SUMIF($F$9:$P$9,\"<>\",$F36:$P36),15-13*PO!$X$3))","v":0},0]
[{"$f":"OFFSET(PO!J$12,ROW(A37)-ROW($A$12),0)","v":"Serviço"},{"$f":"IF($A37=0,\"\",OFFSET(PO!K$12,ROW(B37)-ROW(B$12),0))","v":"1.1.4.8."},{"$f":"IF(OFFSET(PO!N$12,ROW(C37)-ROW(C$12),0)=0,\"\",OFFSET(PO!N$12,ROW(C37)-ROW(C$12),0))","v":"Construção de  pavimento com aplicação de CBUQ, camada de rolamento, com espessura 5 cm, exclusive transporte. AF_03/2017"},{"$f":"IF(OFFSET(PO!O$12,ROW(D37)-ROW(D$12),0)=0,\"\",OFFSET(PO!O$12,ROW(D37)-ROW(D$12),0))","v":"m³"},{"$f":"IF($A37<>\"Serviço\",0,ROUND(SUMIF($F$9:$P$9,\"<>\",$F37:$P37),15-13*PO!$X$3))","v":0},0]
[{"$f":"OFFSET(PO!J$12,ROW(A38)-ROW($A$12),0)","v":"Serviço"},{"$f":"IF($A38=0,\"\",OFFSET(PO!K$12,ROW(B38)-ROW(B$12),0))","v":"1.1.4.9."},{"$f":"IF(OFFSET(PO!N$12,ROW(C38)-ROW(C$12),0)=0,\"\",OFFSET(PO!N$12,ROW(C38)-ROW(C$12),0))","v":"Transporte comercial com caminhão basculante  18 m³, via pavimentada DMT acima de 30Km (unidade:m³xKm). AF_09/2016 DMT=43km"},{"$f":"IF(OFFSET(PO!O$12,ROW(D38)-ROW(D$12),0)=0,\"\",OFFSET(PO!O$12,ROW(D38)-ROW(D$12),0))","v":"m³xKm"},{"$f":"IF($A38<>\"Serviço\",0,ROUND(SUMIF($F$9:$P$9,\"<>\",$F38:$P38),15-13*PO!$X$3))","v":0},0]
[{"$f":"OFFSET(PO!J$12,ROW(A39)-ROW($A$12),0)","v":"Nível 3"},{"$f":"IF($A39=0,\"\",OFFSET(PO!K$12,ROW(B39)-ROW(B$12),0))","v":"1.1.5."},{"$f":"IF(OFFSET(PO!N$12,ROW(C39)-ROW(C$12),0)=0,\"\",OFFSET(PO!N$12,ROW(C39)-ROW(C$12),0))","v":"PASSEIOS"},{"$f":"IF(OFFSET(PO!O$12,ROW(D39)-ROW(D$12),0)=0,\"\",OFFSET(PO!O$12,ROW(D39)-ROW(D$12),0))","v":""},{"$f":"IF($A39<>\"Serviço\",0,ROUND(SUMIF($F$9:$P$9,\"<>\",$F39:$P39),15-13*PO!$X$3))","v":0},0]
[{"$f":"OFFSET(PO!J$12,ROW(A40)-ROW($A$12),0)","v":"Serviço"},{"$f":"IF($A40=0,\"\",OFFSET(PO!K$12,ROW(B40)-ROW(B$12),0))","v":"1.1.5.1."},{"$f":"IF(OFFSET(PO!N$12,ROW(C40)-ROW(C$12),0)=0,\"\",OFFSET(PO!N$12,ROW(C40)-ROW(C$12),0))","v":"Regularização e compactação da base"},{"$f":"IF(OFFSET(PO!O$12,ROW(D40)-ROW(D$12),0)=0,\"\",OFFSET(PO!O$12,ROW(D40)-ROW(D$12),0))","v":"m²"},{"$f":"IF($A40<>\"Serviço\",0,ROUND(SUMIF($F$9:$P$9,\"<>\",$F40:$P40),15-13*PO!$X$3))","v":0},0]
[{"$f":"OFFSET(PO!J$12,ROW(A41)-ROW($A$12),0)","v":"Serviço"},{"$f":"IF($A41=0,\"\",OFFSET(PO!K$12,ROW(B41)-ROW(B$12),0))","v":"1.1.5.2."},{"$f":"IF(OFFSET(PO!N$12,ROW(C41)-ROW(C$12),0)=0,\"\",OFFSET(PO!N$12,ROW(C41)-ROW(C$12),0))","v":"Lastro de brita - espessura 3 cm "},{"$f":"IF(OFFSET(PO!O$12,ROW(D41)-ROW(D$12),0)=0,\"\",OFFSET(PO!O$12,ROW(D41)-ROW(D$12),0))","v":"m³"},{"$f":"IF($A41<>\"Serviço\",0,ROUND(SUMIF($F$9:$P$9,\"<>\",$F41:$P41),15-13*PO!$X$3))","v":0},0]
[{"$f":"OFFSET(PO!J$12,ROW(A42)-ROW($A$12),0)","v":"Serviço"},{"$f":"IF($A42=0,\"\",OFFSET(PO!K$12,ROW(B42)-ROW(B$12),0))","v":"1.1.5.3."},{"$f":"IF(OFFSET(PO!N$12,ROW(C42)-ROW(C$12),0)=0,\"\",OFFSET(PO!N$12,ROW(C42)-ROW(C$12),0))","v":"Execução de passeios (calçada) ou piso de concreto moldado in loco, espessura 6 cm,  usinado, acabamento convencional, não armado. AF_07/2016"},{"$f":"IF(OFFSET(PO!O$12,ROW(D42)-ROW(D$12),0)=0,\"\",OFFSET(PO!O$12,ROW(D42)-ROW(D$12),0))","v":"m³"},{"$f":"IF($A42<>\"Serviço\",0,ROUND(SUMIF($F$9:$P$9,\"<>\",$F42:$P42),15-13*PO!$X$3))","v":0},0]
[{"$f":"OFFSET(PO!J$12,ROW(A43)-ROW($A$12),0)","v":"Serviço"},{"$f":"IF($A43=0,\"\",OFFSET(PO!K$12,ROW(B43)-ROW(B$12),0))","v":"1.1.5.4."},{"$f":"IF(OFFSET(PO!N$12,ROW(C43)-ROW(C$12),0)=0,\"\",OFFSET(PO!N$12,ROW(C43)-ROW(C$12),0))","v":"Execução de passeios (calçada) ou piso de concreto moldado in loco, espessura 6 cm, usinado, acabamento convencional, armado. AF_07/2016"},{"$f":"IF(OFFSET(PO!O$12,ROW(D43)-ROW(D$12),0)=0,\"\",OFFSET(PO!O$12,ROW(D43)-ROW(D$12),0))","v":"m²"},{"$f":"IF($A43<>\"Serviço\",0,ROUND(SUMIF($F$9:$P$9,\"<>\",$F43:$P43),15-13*PO!$X$3))","v":108},{"$f":"OFFSET(PO!$P$12,ROW($E43)-ROW(F$12),0)","v":108}]
[{"$f":"OFFSET(PO!J$12,ROW(A44)-ROW($A$12),0)","v":"Serviço"},{"$f":"IF($A44=0,\"\",OFFSET(PO!K$12,ROW(B44)-ROW(B$12),0))","v":"1.1.5.5."},{"$f":"IF(OFFSET(PO!N$12,ROW(C44)-ROW(C$12),0)=0,\"\",OFFSET(PO!N$12,ROW(C44)-ROW(C$12),0))","v":"Piso podotátil de concreto - direcional, 40 x 40 x 2,5 cm (comprimento X largura X espessura)"},{"$f":"IF(OFFSET(PO!O$12,ROW(D44)-ROW(D$12),0)=0,\"\",OFFSET(PO!O$12,ROW(D44)-ROW(D$12),0))","v":"Unidade"},{"$f":"IF($A44<>\"Serviço\",0,ROUND(SUMIF($F$9:$P$9,\"<>\",$F44:$P44),15-13*PO!$X$3))","v":0},0]
[{"$f":"OFFSET(PO!J$12,ROW(A45)-ROW($A$12),0)","v":"Serviço"},{"$f":"IF($A45=0,\"\",OFFSET(PO!K$12,ROW(B45)-ROW(B$12),0))","v":"1.1.5.6."},{"$f":"IF(OFFSET(PO!N$12,ROW(C45)-ROW(C$12),0)=0,\"\",OFFSET(PO!N$12,ROW(C45)-ROW(C$12),0))","v":"Piso podotátil de concreto - alerta, 40 x 40 x 2,5 cm (comprimento X largura X espessura)"},{"$f":"IF(OFFSET(PO!O$12,ROW(D45)-ROW(D$12),0)=0,\"\",OFFSET(PO!O$12,ROW(D45)-ROW(D$12),0))","v":"Unidade"},{"$f":"IF($A45<>\"Serviço\",0,ROUND(SUMIF($F$9:$P$9,\"<>\",$F45:$P45),15-13*PO!$X$3))","v":60},60]
[{"$f":"OFFSET(PO!J$12,ROW(A46)-ROW($A$12),0)","v":"Nível 3"},{"$f":"IF($A46=0,\"\",OFFSET(PO!K$12,ROW(B46)-ROW(B$12),0))","v":"1.1.6."},{"$f":"IF(OFFSET(PO!N$12,ROW(C46)-ROW(C$12),0)=0,\"\",OFFSET(PO!N$12,ROW(C46)-ROW(C$12),0))","v":"MURETA DE BALISAMENTO EM CONCRETO"},{"$f":"IF(OFFSET(PO!O$12,ROW(D46)-ROW(D$12),0)=0,\"\",OFFSET(PO!O$12,ROW(D46)-ROW(D$12),0))","v":""},{"$f":"IF($A46<>\"Serviço\",0,ROUND(SUMIF($F$9:$P$9,\"<>\",$F46:$P46),15-13*PO!$X$3))","v":0},0]
[{"$f":"OFFSET(PO!J$12,ROW(A47)-ROW($A$12),0)","v":"Serviço"},{"$f":"IF($A47=0,\"\",OFFSET(PO!K$12,ROW(B47)-ROW(B$12),0))","v":"1.1.6.1."},{"$f":"IF(OFFSET(PO!N$12,ROW(C47)-ROW(C$12),0)=0,\"\",OFFSET(PO!N$12,ROW(C47)-ROW(C$12),0))","v":"Forma em tábua 2,5 x 30 cm, em pinus, mista ou equivalente da região"},{"$f":"IF(OFFSET(PO!O$12,ROW(D47)-ROW(D$12),0)=0,\"\",OFFSET(PO!O$12,ROW(D47)-ROW(D$12),0))","v":"m²"},{"$f":"IF($A47<>\"Serviço\",0,ROUND(SUMIF($F$9:$P$9,\"<>\",$F47:$P47),15-13*PO!$X$3))","v":15},15]
[{"$f":"OFFSET(PO!J$12,ROW(A48)-ROW($A$12),0)","v":"Serviço"},{"$f":"IF($A48=0,\"\",OFFSET(PO!K$12,ROW(B48)-ROW(B$12),0))","v":"1.1.6.2."},{"$f":"IF(OFFSET(PO!N$12,ROW(C48)-ROW(C$12),0)=0,\"\",OFFSET(PO!N$12,ROW(C48)-ROW(C$12),0))","v":"Concreto Usinado bombeavel, classe de resistência C20, com brita 0 e 1, Slump = 130 +- 20 mm, exclui o serviço de bombeamento (NBR8953)"},{"$f":"IF(OFFSET(PO!O$12,ROW(D48)-ROW(D$12),0)=0,\"\",OFFSET(PO!O$12,ROW(D48)-ROW(D$12),0))","v":"m³"},{"$f":"IF($A48<>\"Serviço\",0,ROUND(SUMIF($F$9:$P$9,\"<>\",$F48:$P48),15-13*PO!$X$3))","v":13.06},13.06]
[{"$f":"OFFSET(PO!J$12,ROW(A49)-ROW($A$12),0)","v":"Serviço"},{"$f":"IF($A49=0,\"\",OFFSET(PO!K$12,ROW(B49)-ROW(B$12),0))","v":"1.1.6.3."},{"$f":"IF(OFFSET(PO!N$12,ROW(C49)-ROW(C$12),0)=0,\"\",OFFSET(PO!N$12,ROW(C49)-ROW(C$12),0))","v":"Treliça nervurada, altura 120 mm , diametro dos banzos inferiores e superiores 6,0 mm e diametro diagonais de 4,2 mm."},{"$f":"IF(OFFSET(PO!O$12,ROW(D49)-ROW(D$12),0)=0,\"\",OFFSET(PO!O$12,ROW(D49)-ROW(D$12),0))","v":"m"},{"$f":"IF($A49<>\"Serviço\",0,ROUND(SUMIF($F$9:$P$9,\"<>\",$F49:$P49),15-13*PO!$X$3))","v":240.1},240.1]
[{"$f":"OFFSET(PO!J$12,ROW(A50)-ROW($A$12),0)","v":"Nível 3"},{"$f":"IF($A50=0,\"\",OFFSET(PO!K$12,ROW(B50)-ROW(B$12),0))","v":"1.1.7."},{"$f":"IF(OFFSET(PO!N$12,ROW(C50)-ROW(C$12),0)=0,\"\",OFFSET(PO!N$12,ROW(C50)-ROW(C$12),0))","v":"PINTURA E SINALIZAÇÃO"},{"$f":"IF(OFFSET(PO!O$12,ROW(D50)-ROW(D$12),0)=0,\"\",OFFSET(PO!O$12,ROW(D50)-ROW(D$12),0))","v":""},{"$f":"IF($A50<>\"Serviço\",0,ROUND(SUMIF($F$9:$P$9,\"<>\",$F50:$P50),15-13*PO!$X$3))","v":0},0]
[{"$f":"OFFSET(PO!J$12,ROW(A51)-ROW($A$12),0)","v":"Serviço"},{"$f":"IF($A51=0,\"\",OFFSET(PO!K$12,ROW(B51)-ROW(B$12),0))","v":"1.1.7.1."},{"$f":"IF(OFFSET(PO!N$12,ROW(C51)-ROW(C$12),0)=0,\"\",OFFSET(PO!N$12,ROW(C51)-ROW(C$12),0))","v":"Pintura de faixa de pedestre, tinta retrorefletiva a base de resina acrilica com micro esferas devidro, aplicação manual. AF_05/2021"},{"$f":"IF(OFFSET(PO!O$12,ROW(D51)-ROW(D$12),0)=0,\"\",OFFSET(PO!O$12,ROW(D51)-ROW(D$12),0))","v":"m²"},{"$f":"IF($A51<>\"Serviço\",0,ROUND(SUMIF($F$9:$P$9,\"<>\",$F51:$P51),15-13*PO!$X$3))","v":0},0]
[{"$f":"OFFSET(PO!J$12,ROW(A52)-ROW($A$12),0)","v":"Serviço"},{"$f":"IF($A52=0,\"\",OFFSET(PO!K$12,ROW(B52)-ROW(B$12),0))","v":"1.1.7.2."},{"$f":"IF(OFFSET(PO!N$12,ROW(C52)-ROW(C$12),0)=0,\"\",OFFSET(PO!N$12,ROW(C52)-ROW(C$12),0))","v":"Pintura de eixo viário, com tinta retrorefletiva a base de resina acrilica com micro esferas de vidro, aplicação macanica com emarcadora autopropelida. AF_05/2021"},{"$f":"IF(OFFSET(PO!O$12,ROW(D52)-ROW(D$12),0)=0,\"\",OFFSET(PO!O$12,ROW(D52)-ROW(D$12),0))","v":"m"},{"$f":"IF($A52<>\"Serviço\",0,ROUND(SUMIF($F$9:$P$9,\"<>\",$F52:$P52),15-13*PO!$X$3))","v":596.66},{"$f":"OFFSET(PO!$P$12,ROW($E52)-ROW(F$12),0)","v":596.66}]
[{"$f":"OFFSET(PO!J$12,ROW(A53)-ROW($A$12),0)","v":"Serviço"},{"$f":"IF($A53=0,\"\",OFFSET(PO!K$12,ROW(B53)-ROW(B$12),0))","v":"1.1.7.3."},{"$f":"IF(OFFSET(PO!N$12,ROW(C53)-ROW(C$12),0)=0,\"\",OFFSET(PO!N$12,ROW(C53)-ROW(C$12),0))","v":"Placa de aço esmaltada para a identificação de Rua 45 cm x 20 cm "},{"$f":"IF(OFFSET(PO!O$12,ROW(D53)-ROW(D$12),0)=0,\"\",OFFSET(PO!O$12,ROW(D53)-ROW(D$12),0))","v":"und"},{"$f":"IF($A53<>\"Serviço\",0,ROUND(SUMIF($F$9:$P$9,\"<>\",$F53:$P53),15-13*PO!$X$3))","v":2},{"$f":"OFFSET(PO!$P$12,ROW($E53)-ROW(F$12),0)","v":2}]
[{"$f":"OFFSET(PO!J$12,ROW(A54)-ROW($A$12),0)","v":"Serviço"},{"$f":"IF($A54=0,\"\",OFFSET(PO!K$12,ROW(B54)-ROW(B$12),0))","v":"1.1.7.4."},{"$f":"IF(OFFSET(PO!N$12,ROW(C54)-ROW(C$12),0)=0,\"\",OFFSET(PO!N$12,ROW(C54)-ROW(C$12),0))","v":"Plaça de sinalização em chapa de aço tot. pintura refletiva"},{"$f":"IF(OFFSET(PO!O$12,ROW(D54)-ROW(D$12),0)=0,\"\",OFFSET(PO!O$12,ROW(D54)-ROW(D$12),0))","v":"m²"},{"$f":"IF($A54<>\"Serviço\",0,ROUND(SUMIF($F$9:$P$9,\"<>\",$F54:$P54),15-13*PO!$X$3))","v":0},0]
[{"$f":"OFFSET(PO!J$12,ROW(A55)-ROW($A$12),0)","v":"Serviço"},{"$f":"IF($A55=0,\"\",OFFSET(PO!K$12,ROW(B55)-ROW(B$12),0))","v":"1.1.7.5."},{"$f":"IF(OFFSET(PO!N$12,ROW(C55)-ROW(C$12),0)=0,\"\",OFFSET(PO!N$12,ROW(C55)-ROW(C$12),0))","v":"Tubo de aço galvanizado c/ costura DN 2 1/2\" (65mm), E=3,35 mm "},{"$f":"IF(OFFSET(PO!O$12,ROW(D55)-ROW(D$12),0)=0,\"\",OFFSET(PO!O$12,ROW(D55)-ROW(D$12),0))","v":"m"},{"$f":"IF($A55<>\"Serviço\",0,ROUND(SUMIF($F$9:$P$9,\"<>\",$F55:$P55),15-13*PO!$X$3))","v":0},0]
[{"$f":"OFFSET(PO!J$12,ROW(A56)-ROW($A$12),0)","v":"Nível 3"},{"$f":"IF($A56=0,\"\",OFFSET(PO!K$12,ROW(B56)-ROW(B$12),0))","v":"1.1.8."},{"$f":"IF(OFFSET(PO!N$12,ROW(C56)-ROW(C$12),0)=0,\"\",OFFSET(PO!N$12,ROW(C56)-ROW(C$12),0))","v":"SERVIÇOS COMPLEMENTARES - LIMPEZA FINAL DA OBRA"},{"$f":"IF(OFFSET(PO!O$12,ROW(D56)-ROW(D$12),0)=0,\"\",OFFSET(PO!O$12,ROW(D56)-ROW(D$12),0))","v":""},{"$f":"IF($A56<>\"Serviço\",0,ROUND(SUMIF($F$9:$P$9,\"<>\",$F56:$P56),15-13*PO!$X$3))","v":0},0]
[{"$f":"OFFSET(PO!J$12,ROW(A57)-ROW($A$12),0)","v":"Serviço"},{"$f":"IF($A57=0,\"\",OFFSET(PO!K$12,ROW(B57)-ROW(B$12),0))","v":"1.1.8.1."},{"$f":"IF(OFFSET(PO!N$12,ROW(C57)-ROW(C$12),0)=0,\"\",OFFSET(PO!N$12,ROW(C57)-ROW(C$12),0))","v":"Caminhão Pipa 10.000L, peso bruto total de 23.000 kg, inclusive tanque de aço para o transporte de água, capacidade de 10 m³"},{"$f":"IF(OFFSET(PO!O$12,ROW(D57)-ROW(D$12),0)=0,\"\",OFFSET(PO!O$12,ROW(D57)-ROW(D$12),0))","v":"h"},{"$f":"IF($A57<>\"Serviço\",0,ROUND(SUMIF($F$9:$P$9,\"<>\",$F57:$P57),15-13*PO!$X$3))","v":0},0]
[]
[]
[null,{"$f":"PO!$K$69","v":"Tunápolis/SC"}]
[null,"Local"]
[]
[null,{"$f":"PO!$K$72","v":"2022-04-11"}]
[null,"Data"]

{"sheet":"CFF","index":4,"n_rows":54,"n_cols":29,"rows_kept":54,"cut":false,"hidden":false,"merged":[[7,11,7,12],[10,13,12,13],[17,12,19,12],[17,13,19,13],[51,16,51,18],[51,12,51,13],[50,16,50,18],[49,16,49,18],[49,11,49,13],[50,12,50,13],[29,11,31,11],[29,12,31,12],[29,13,31,13],[32,12,34,12],[32,13,34,13],[35,11,37,11],[52,11,52,13],[10,11,12,11],[10,12,12,12],[13,11,16,12],[13,13,16,13],[17,11,19,11],[20,11,22,11],[20,12,22,12],[20,13,22,13],[23,11,25,11],[23,12,25,12],[23,13,25,13],[26,11,28,11],[26,12,28,12],[26,13,28,13],[32,11,34,11],[35,12,37,12],[35,13,37,13],[44,11,46,11],[44,12,46,12],[44,13,46,13],[38,11,40,11],[38,12,40,12],[38,13,40,13],[41,11,43,11],[41,12,43,12],[41,13,43,13]]}
[null,null,null,null,null,null,null,null,null,null,null,null,null,null,"    CFF -","CRONOGRAMA FÍSICO-FINANCEIRO"]
[null,null,null,null,null,null,null,null,null,null,null,null,null,null,null,{"$f":"CHOOSE(1+LOG(1+2*(TipoOrçamento=\"BASE\")+4*(TipoOrçamento=\"LICITADO\")+8*(TipoOrçamento=\"REPROGRAMADOAC\")+16*(TipoOrçamento=\"REPROGRAMADONPL\"),2),\"nada\",\"Cronograma Base para Licitação\",\"Cronograma Licitado\",\"Cronograma Licitado Reprogramado\",\"Cronograma Base para Licitação - Reprogramado\")","v":"Cronograma Base para Licitação"}]
[]
[]
[]
[]
[]
["Nível Máx Crono",null,null,null,null,null,null,null,null,null,null,{"$f":"IF(MAX($A$14:$A$49)<>MAX(PO!$V$12:$V$58),\"ERRO: CRONOGRAMA DESATUALIZADO\",IF(OR(COUNTIF($O$16:$X$16,\">1\")>0,OFFSET($X$17,0,-1)<>$N$14),\"ERRO: CRONOGRAMA NÃO FECHA EM 100%\",\"\"))","v":""},null,{"$f":"IF(TipoOrçamento=\"REPROGRAMADOAC\",\"Qtde de Medições realizadas\",\"\")","v":""}]
[3,null,null,null,null,null,null,null,null,null,null,null,null,1,{"$f":"IF(AND(TipoOrçamento=\"REPROGRAMADOAC\",$N$9>0),$N$9-1,0)","v":0},{"$f":"OFFSET(P9,0,-1)+1","v":1},2,3,4,5,6,7,8,null,null,null,null,null,{"$f":"OFFSET(AC9,0,-1)+1","v":1}]
["Lista Crono","Último Nível","Nível","Altura","N1","N2","N3","N4","Czero","Cnível","VTOTAL SOMA","Item","Descrição das Metas / Macrosserviços","Valores Totais (R$)",{"$f":"IF(TipoOrçamento=\"REPROGRAMADOAC\",\"Reinício de Obra\",\"Início de Obra\")&CHAR(10)&TEXT(DADOS!A48,\"dd/mm/aa\")","v":"Início de Obra\n11/04/22"},{"$f":"IF(AND(TipoOrçamento=\"REPROGRAMADOAC\",$N$9>0,N10=\"Valores Totais (R$)\"),\"Parcela \"&$N$9&\" Executado\",\"Parcela \"&P$9&CHAR(10)&TEXT(DATE(YEAR(DADOS!$A$48),MONTH(DADOS!$A$48)+P$9-IF(AND(TipoOrçamento=\"REPROGRAMADOAC\",$N$9>0),$N$9,0),1),\"mmm/aa\"))","v":"Parcela 1\nmai/22"},{"$f":"IF(AND(TipoOrçamento=\"REPROGRAMADOAC\",$N$9>0,O10=\"Valores Totais (R$)\"),\"Parcela \"&$N$9&\" Executado\",\"Parcela \"&Q$9&CHAR(10)&TEXT(DATE(YEAR(DADOS!$A$48),MONTH(DADOS!$A$48)+Q$9-IF(AND(TipoOrçamento=\"REPROGRAMADOAC\",$N$9>0),$N$9,0),1),\"mmm/aa\"))","v":"Parcela 2\njun/22"},{"$f":"IF(AND(TipoOrçamento=\"REPROGRAMADOAC\",$N$9>0,P10=\"Valores Totais (R$)\"),\"Parcela \"&$N$9&\" Executado\",\"Parcela \"&R$9&CHAR(10)&TEXT(DATE(YEAR(DADOS!$A$48),MONTH(DADOS!$A$48)+R$9-IF(AND(TipoOrçamento=\"REPROGRAMADOAC\",$N$9>0),$N$9,0),1),\"mmm/aa\"))","v":"Parcela 3\njul/22"},{"$f":"IF(AND(TipoOrçamento=\"REPROGRAMADOAC\",$N$9>0,Q10=\"Valores Totais (R$)\"),\"Parcela \"&$N$9&\" Executado\",\"Parcela \"&S$9&CHAR(10)&TEXT(DATE(YEAR(DADOS!$A$48),MONTH(DADOS!$A$48)+S$9-IF(AND(TipoOrçamento=\"REPROGRAMADOAC\",$N$9>0),$N$9,0),1),\"mmm/aa\"))","v":"Parcela 4\nago/22"},{"$f":"IF(AND(TipoOrçamento=\"REPROGRAMADOAC\",$N$9>0,R10=\"Valores Totais (R$)\"),\"Parcela \"&$N$9&\" Executado\",\"Parcela \"&T$9&CHAR(10)&TEXT(DATE(YEAR(DADOS!$A$48),MONTH(DADOS!$A$48)+T$9-IF(AND(TipoOrçamento=\"REPROGRAMADOAC\",$N$9>0),$N$9,0),1),\"mmm/aa\"))","v":"Parcela 5\nset/22"},{"$f":"IF(AND(TipoOrçamento=\"REPROGRAMADOAC\",$N$9>0,S10=\"Valores Totais (R$)\"),\"Parcela \"&$N$9&\" Executado\",\"Parcela \"&U$9&CHAR(10)&TEXT(DATE(YEAR(DADOS!$A$48),MONTH(DADOS!$A$48)+U$9-IF(AND(TipoOrçamento=\"REPROGRAMADOAC\",$N$9>0),$N$9,0),1),\"mmm/aa\"))","v":"Parcela 6\nout/22"},{"$f":"IF(AND(TipoOrçamento=\"REPROGRAMADOAC\",$N$9>0,T10=\"Valores Totais (R$)\"),\"Parcela \"&$N$9&\" Executado\",\"Parcela \"&V$9&CHAR(10)&TEXT(DATE(YEAR(DADOS!$A$48),MONTH(DADOS!$A$48)+V$9-IF(AND(TipoOrçamento=\"REPROGRAMADOAC\",$N$9>0),$N$9,0),1),\"mmm/aa\"))","v":"Parcela 7\nnov/22"},{"$f":"IF(AND(TipoOrçamento=\"REPROGRAMADOAC\",$N$9>0,U10=\"Valores Totais (R$)\"),\"Parcela \"&$N$9&\" Executado\",\"Parcela \"&W$9&CHAR(10)&TEXT(DATE(YEAR(DADOS!$A$48),MONTH(DADOS!$A$48)+W$9-IF(AND(TipoOrçamento=\"REPROGRAMADOAC\",$N$9>0),$N$9,0),1),\"mmm/aa\"))","v":"Parcela 8\ndez/22"},null,null,null,null,null,{"$f":"IF(AND(TipoOrçamento=\"REPROGRAMADOAC\",$N$9>0,AA10=\"Valores Totais (R$)\"),\"Parcela \"&$N$9&\" Executado\",\"Parcela \"&AC$9&CHAR(10)&TEXT(DATE(YEAR(DADOS!$A$48),MONTH(DADOS!$A$48)+AC$9-IF(AND(TipoOrçamento=\"REPROGRAMADOAC\",$N$9>0),$N$9,0),1),\"mmm/aa\"))","v":"Parcela 1\nmai/22"}]
[null,null,null,null,null,null,null,null,null,null,null,{"$f":"INDEX(PO!K$12:K$58,MATCH($A13,PO!$V$12:$V$58,0))","v":{"$error":"#VALUE!"}},{"$f":"INDEX(PO!N$12:N$58,MATCH($A13,PO!$V$12:$V$58,0))","v":{"$error":"#VALUE!"}},{"$f":"IF(ROUND(K13,2)=0,K13,ROUND(K13,2))","v":{"$error":"#VALUE!"}},"Parcela (%)",{"$f":"IF($B13,0,P12-IF(ISNUMBER(O12),O12,0))","v":{"$error":"#VALUE!"}},{"$f":"IF($B13,0,Q12-IF(ISNUMBER(P12),P12,0))","v":{"$error":"#VALUE!"}},{"$error":"#VALUE!"},{"$error":"#VALUE!"},{"$error":"#VALUE!"},{"$error":"#VALUE!"},{"$error":"#VALUE!"},{"$error":"#VALUE!"},null,null,null,null,null,{"$f":"IF($B13,0,AC12-IF(ISNUMBER(AB12),AB12,0))","v":{"$error":"#VALUE!"}}]
[null,null,null,null,null,null,null,null,null,null,null,null,null,null,"Acumulado (%)",{"$f":"MIN(IF($B13,P11+IF(ISNUMBER(O12),O12,0),P13/$N11),1)","v":{"$error":"#VALUE!"}},{"$f":"MIN(IF($B13,Q11+IF(ISNUMBER(P12),P12,0),Q13/$N11),1)","v":{"$error":"#VALUE!"}},{"$error":"#VALUE!"},{"$error":"#VALUE!"},{"$error":"#VALUE!"},{"$error":"#VALUE!"},{"$error":"#VALUE!"},{"$error":"#VALUE!"},null,null,null,null,null,{"$f":"MIN(IF($B13,AC11+IF(ISNUMBER(AB12),AB12,0),AC13/$N11),1)","v":{"$error":"#VALUE!"}}]
[{"$f":"OFFSET(A13,-CFF.NumLinha,0)+1","v":{"$error":"#VALUE!"}},{"$f":"$C13>=OFFSET($C13,CFF.NumLinha,0)","v":{"$error":"#VALUE!"}},{"$f":"INDEX(PO!A$12:A$58,MATCH($A13,PO!$V$12:$V$58,0))","v":{"$error":"#VALUE!"}},{"$f":"IF(ISERROR(J13),I13,SMALL(I13:J13,1))-1","v":{"$error":"#VALUE!"}},{"$f":"IF($C13=1,OFFSET(E13,-CFF.NumLinha,0)+1,OFFSET(E13,-CFF.NumLinha,0))","v":{"$error":"#VALUE!"}},{"$f":"IF($C13=1,0,IF($C13=2,OFFSET(F13,-CFF.NumLinha,0)+1,OFFSET(F13,-CFF.NumLinha,0)))","v":{"$error":"#VALUE!"}},{"$f":"IF(AND($C13<=2,$C13<>0),0,IF($C13=3,OFFSET(G13,-CFF.NumLinha,0)+1,OFFSET(G13,-CFF.NumLinha,0)))","v":{"$error":"#VALUE!"}},{"$f":"IF(AND($C13<=3,$C13<>0),0,IF($C13=4,OFFSET(H13,-CFF.NumLinha,0)+1,OFFSET(H13,-CFF.NumLinha,0)))","v":{"$error":"#VALUE!"}},{"$f":"MATCH(0,OFFSET($D13,1,$C13,ROW($A$48)-ROW($A13)),0)","v":{"$error":"#VALUE!"}},{"$f":"MATCH(OFFSET($D13,0,$C13)+1,OFFSET($D13,1,$C13,ROW($A$48)-ROW($A13)),0)","v":{"$error":"#VALUE!"}},{"$f":"ROUND(INDEX(PO!T$12:T$58,MATCH($A13,PO!$V$12:$V$58,0)),2)+10^-12","v":{"$error":"#VALUE!"}},null,null,null,"Acumulado (R$)",{"$f":"IF($B13,ROUND(P12*$N11,2),ROUND(SUMIF(OFFSET($B13,1,0,$D13),TRUE,OFFSET(P13,1,0,$D13))/SUMIF(OFFSET($B13,1,0,$D13),TRUE,OFFSET($K13,1,0,$D13))*$N11,2))","v":{"$error":"#VALUE!"}},{"$f":"IF($B13,ROUND(Q12*$N11,2),ROUND(SUMIF(OFFSET($B13,1,0,$D13),TRUE,OFFSET(Q13,1,0,$D13))/SUMIF(OFFSET($B13,1,0,$D13),TRUE,OFFSET($K13,1,0,$D13))*$N11,2))","v":{"$error":"#VALUE!"}},{"$error":"#VALUE!"},{"$error":"#VALUE!"},{"$error":"#VALUE!"},{"$error":"#VALUE!"},{"$error":"#VALUE!"},{"$error":"#VALUE!"},null,null,null,null,null,{"$f":"IF($B13,ROUND(AC12*$N11,2),ROUND(SUMIF(OFFSET($B13,1,0,$D13),TRUE,OFFSET(AC13,1,0,$D13))/SUMIF(OFFSET($B13,1,0,$D13),TRUE,OFFSET($K13,1,0,$D13))*$N11,2))","v":{"$error":"#VALUE!"}}]
[null,null,null,null,null,null,null,null,null,null,null,"CRONOGRAMA GLOBAL DO LOTE",null,{"$f":"IF(PO!$T$12=0,10^-12,PO!$T$12)","v":489719.26},"Parcela (%)",{"$f":"ROUND(P15/$N14,4)","v":9.7299999999999998E-2},{"$f":"ROUND(Q15/$N14,4)","v":0.2359},0.1754,0.37019999999999997,5.8799999999999998E-2,6.2399999999999997E-2,0,0,null,null,null,null,null,{"$f":"ROUND(AC15/$N14,4)","v":0}]
[null,null,null,null,null,null,null,null,null,null,null,null,null,null,"Parcela (R$)",{"$f":"P17-IF(ISNUMBER(O17),O17,0)","v":47634.37},{"$f":"Q17-IF(ISNUMBER(P17),P17,0)","v":115538.20999999999},85900.150000000023,181311.98,28792.789999999979,30541.760000000009,0,0,null,null,null,null,null,{"$f":"AC17-IF(ISNUMBER(AB17),AB17,0)","v":0}]
[null,null,null,null,null,null,null,null,null,null,null,null,null,null,"Acumulado (%)",{"$f":"ROUND(P17/$N14,4)","v":9.7299999999999998E-2},{"$f":"ROUND(Q17/$N14,4)","v":0.3332},0.50860000000000005,0.87880000000000003,0.93759999999999999,1,1,1,null,null,null,null,null,{"$f":"ROUND(AC17/$N14,4)","v":0}]
[0,null,null,{"$f":"ROW(D$48)-ROW(D18)","v":30},null,null,null,null,null,null,null,null,null,null,"Acumulado (R$)",{"$f":"SUMIF(OFFSET($C17,1,0):$C$48,1,OFFSET(P17,1,0):P$48)","v":47634.37},{"$f":"SUMIF(OFFSET($C17,1,0):$C$48,1,OFFSET(Q17,1,0):Q$48)","v":163172.57999999999},{"$f":"SUMIF(OFFSET($C17,1,0):$C$48,1,OFFSET(R17,1,0):R$48)","v":249072.73},{"$f":"SUMIF(OFFSET($C17,1,0):$C$48,1,OFFSET(S17,1,0):S$48)","v":430384.71},{"$f":"SUMIF(OFFSET($C17,1,0):$C$48,1,OFFSET(T17,1,0):T$48)","v":459177.5},{"$f":"SUMIF(OFFSET($C17,1,0):$C$48,1,OFFSET(U17,1,0):U$48)","v":489719.26},{"$f":"SUMIF(OFFSET($C17,1,0):$C$48,1,OFFSET(V17,1,0):V$48)","v":489719.26},{"$f":"SUMIF(OFFSET($C17,1,0):$C$48,1,OFFSET(W17,1,0):W$48)","v":489719.26},null,null,null,null,null,{"$f":"SUMIF(OFFSET($C17,1,0):$C$48,1,OFFSET(AC17,1,0):AC$48)","v":0}]
[null,null,null,null,null,null,null,null,null,null,null,{"$f":"INDEX(PO!K$12:K$58,MATCH($A20,PO!$V$12:$V$58,0))","v":"1."},{"$f":"INDEX(PO!N$12:N$58,MATCH($A20,PO!$V$12:$V$58,0))","v":"PAVIMENTAÇÃO ASFÁLTICA"},{"$f":"IF(ROUND(K20,2)=0,K20,ROUND(K20,2))","v":489719.26},"Parcela (%)",{"$f":"IF($B20,0,P19-IF(ISNUMBER(O19),O19,0))","v":9.7268729026503881E-2},0.23592743728314866,0.17540692600082752,0.37023657186772685,5.8794481556637135E-2,6.2365854265155951E-2,0,0,"",null,null,null,null,{"$f":"IF($B20,0,AC19-IF(ISNUMBER(AB19),AB19,0))","v":0}]
[null,null,null,null,null,null,null,null,null,null,null,null,null,null,"Acumulado (%)",{"$f":"MIN(IF($B20,P18+IF(ISNUMBER(O19),O19,0),P20/$N18),1)","v":9.7268729026503881E-2},0.33319616630965254,0.50860309231048006,0.87883966417820691,0.93763414573484405,1,1,1,null,null,null,null,null,{"$f":"MIN(IF($B20,AC18+IF(ISNUMBER(AB19),AB19,0),AC20/$N18),1)","v":0}]
[{"$f":"OFFSET(A20,-CFF.NumLinha,0)+1","v":1},{"$f":"$C20>=OFFSET($C20,CFF.NumLinha,0)","v":false},{"$f":"INDEX(PO!A$12:A$58,MATCH($A20,PO!$V$12:$V$58,0))","v":1},{"$f":"IF(ISERROR(J20),I20,SMALL(I20:J20,1))-1","v":27},{"$f":"IF($C20=1,OFFSET(E20,-CFF.NumLinha,0)+1,OFFSET(E20,-CFF.NumLinha,0))","v":1},{"$f":"IF($C20=1,0,IF($C20=2,OFFSET(F20,-CFF.NumLinha,0)+1,OFFSET(F20,-CFF.NumLinha,0)))","v":0},{"$f":"IF(AND($C20<=2,$C20<>0),0,IF($C20=3,OFFSET(G20,-CFF.NumLinha,0)+1,OFFSET(G20,-CFF.NumLinha,0)))","v":0},{"$f":"IF(AND($C20<=3,$C20<>0),0,IF($C20=4,OFFSET(H20,-CFF.NumLinha,0)+1,OFFSET(H20,-CFF.NumLinha,0)))","v":0},{"$f":"MATCH(0,OFFSET($D20,1,$C20,ROW($A$48)-ROW($A20)),0)","v":28},{"$f":"MATCH(OFFSET($D20,0,$C20)+1,OFFSET($D20,1,$C20,ROW($A$48)-ROW($A20)),0)","v":{"$error":"#N/A"}},{"$f":"ROUND(INDEX(PO!T$12:T$58,MATCH($A20,PO!$V$12:$V$58,0)),2)+10^-12","v":489719.26},null,null,null,"Acumulado (R$)",{"$f":"IF($B20,ROUND(P19*$N18,2),ROUND(SUMIF(OFFSET($B20,1,0,$D20),TRUE,OFFSET(P20,1,0,$D20))/SUMIF(OFFSET($B20,1,0,$D20),TRUE,OFFSET($K20,1,0,$D20))*$N18,2))","v":47634.37},163172.57999999999,249072.73,430384.71,459177.5,489719.26,489719.26,489719.26,null,null,null,null,null,{"$f":"IF($B20,ROUND(AC19*$N18,2),ROUND(SUMIF(OFFSET($B20,1,0,$D20),TRUE,OFFSET(AC20,1,0,$D20))/SUMIF(OFFSET($B20,1,0,$D20),TRUE,OFFSET($K20,1,0,$D20))*$N18,2))","v":0}]
[null,null,null,null,null,null,null,null,null,null,null,{"$f":"INDEX(PO!K$12:K$58,MATCH($A23,PO!$V$12:$V$58,0))","v":"1.1."},{"$f":"INDEX(PO!N$12:N$58,MATCH($A23,PO!$V$12:$V$58,0))","v":"RUAS FELIPE ARSÊNIO BAMBERG E AMELDA TEREZA BIEGER "},{"$f":"IF(ROUND(K23,2)=0,K23,ROUND(K23,2))","v":489719.26},"Parcela (%)",{"$f":"IF($B23,0,P22-IF(ISNUMBER(O22),O22,0))","v":9.7268729026503881E-2},{"$f":"IF($B23,0,Q22-IF(ISNUMBER(P22),P22,0))","v":0.23592743728314866},{"$f":"IF($B23,0,R22-IF(ISNUMBER(Q22),Q22,0))","v":0.17540692600082752},{"$f":"IF($B23,0,S22-IF(ISNUMBER(R22),R22,0))","v":0.37023657186772685},{"$f":"IF($B23,0,T22-IF(ISNUMBER(S22),S22,0))","v":5.8794481556637135E-2},{"$f":"IF($B23,0,U22-IF(ISNUMBER(T22),T22,0))","v":6.2365854265155951E-2},{"$f":"IF($B23,0,V22-IF(ISNUMBER(U22),U22,0))","v":0},{"$f":"IF($B23,0,W22-IF(ISNUMBER(V22),V22,0))","v":0},null,null,null,null,null,{"$f":"IF($B23,0,AC22-IF(ISNUMBER(AB22),AB22,0))","v":0}]
[null,null,null,null,null,null,null,null,null,null,null,null,null,null,"Acumulado (%)",{"$f":"MIN(IF($B23,P21+IF(ISNUMBER(O22),O22,0),P23/$N21),1)","v":9.7268729026503881E-2},{"$f":"MIN(IF($B23,Q21+IF(ISNUMBER(P22),P22,0),Q23/$N21),1)","v":0.33319616630965254},{"$f":"MIN(IF($B23,R21+IF(ISNUMBER(Q22),Q22,0),R23/$N21),1)","v":0.50860309231048006},{"$f":"MIN(IF($B23,S21+IF(ISNUMBER(R22),R22,0),S23/$N21),1)","v":0.87883966417820691},{"$f":"MIN(IF($B23,T21+IF(ISNUMBER(S22),S22,0),T23/$N21),1)","v":0.93763414573484405},{"$f":"MIN(IF($B23,U21+IF(ISNUMBER(T22),T22,0),U23/$N21),1)","v":1},{"$f":"MIN(IF($B23,V21+IF(ISNUMBER(U22),U22,0),V23/$N21),1)","v":1},{"$f":"MIN(IF($B23,W21+IF(ISNUMBER(V22),V22,0),W23/$N21),1)","v":1},null,null,null,null,null,{"$f":"MIN(IF($B23,AC21+IF(ISNUMBER(AB22),AB22,0),AC23/$N21),1)","v":0}]
[{"$f":"OFFSET(A23,-CFF.NumLinha,0)+1","v":2},{"$f":"$C23>=OFFSET($C23,CFF.NumLinha,0)","v":false},{"$f":"INDEX(PO!A$12:A$58,MATCH($A23,PO!$V$12:$V$58,0))","v":2},{"$f":"IF(ISERROR(J23),I23,SMALL(I23:J23,1))-1","v":24},{"$f":"IF($C23=1,OFFSET(E23,-CFF.NumLinha,0)+1,OFFSET(E23,-CFF.NumLinha,0))","v":1},{"$f":"IF($C23=1,0,IF($C23=2,OFFSET(F23,-CFF.NumLinha,0)+1,OFFSET(F23,-CFF.NumLinha,0)))","v":1},{"$f":"IF(AND($C23<=2,$C23<>0),0,IF($C23=3,OFFSET(G23,-CFF.NumLinha,0)+1,OFFSET(G23,-CFF.NumLinha,0)))","v":0},{"$f":"IF(AND($C23<=3,$C23<>0),0,IF($C23=4,OFFSET(H23,-CFF.NumLinha,0)+1,OFFSET(H23,-CFF.NumLinha,0)))","v":0},{"$f":"MATCH(0,OFFSET($D23,1,$C23,ROW($A$48)-ROW($A23)),0)","v":25},{"$f":"MATCH(OFFSET($D23,0,$C23)+1,OFFSET($D23,1,$C23,ROW($A$48)-ROW($A23)),0)","v":{"$error":"#N/A"}},{"$f":"ROUND(INDEX(PO!T$12:T$58,MATCH($A23,PO!$V$12:$V$58,0)),2)+10^-12","v":489719.26},null,null,null,"Acumulado (R$)",{"$f":"IF($B23,ROUND(P22*$N21,2),ROUND(SUMIF(OFFSET($B23,1,0,$D23),TRUE,OFFSET(P23,1,0,$D23))/SUMIF(OFFSET($B23,1,0,$D23),TRUE,OFFSET($K23,1,0,$D23))*$N21,2))","v":47634.37},163172.57999999999,249072.73,430384.71,459177.5,489719.26,489719.26,489719.26,null,null,null,null,null,{"$f":"IF($B23,ROUND(AC22*$N21,2),ROUND(SUMIF(OFFSET($B23,1,0,$D23),TRUE,OFFSET(AC23,1,0,$D23))/SUMIF(OFFSET($B23,1,0,$D23),TRUE,OFFSET($K23,1,0,$D23))*$N21,2))","v":0}]
[null,null,null,null,null,null,null,null,null,null,null,{"$f":"INDEX(PO!K$12:K$58,MATCH($A26,PO!$V$12:$V$58,0))","v":"1.1.1."},{"$f":"INDEX(PO!N$12:N$58,MATCH($A26,PO!$V$12:$V$58,0))","v":"SERVIÇOS PRELIMINARES "},{"$f":"IF(ROUND(K26,2)=0,K26,ROUND(K26,2))","v":5913.39},"Parcela (%)",1,0.05,0.05,0.05,0.05,0.05,{"$f":"IF($B26,0,V25-IF(ISNUMBER(U25),U25,0))","v":0},{"$f":"IF($B26,0,W25-IF(ISNUMBER(V25),V25,0))","v":0},null,null,null,null,null,{"$f":"IF($B26,0,AC25-IF(ISNUMBER(AB25),AB25,0))","v":0}]
[null,null,null,null,null,null,null,null,null,null,null,null,null,null,"Acumulado (%)",{"$f":"MIN(IF($B26,P24+IF(ISNUMBER(O25),O25,0),P26/$N24),1)","v":1},{"$f":"MIN(IF($B26,Q24+IF(ISNUMBER(P25),P25,0),Q26/$N24),1)","v":1},{"$f":"MIN(IF($B26,R24+IF(ISNUMBER(Q25),Q25,0),R26/$N24),1)","v":1},{"$f":"MIN(IF($B26,S24+IF(ISNUMBER(R25),R25,0),S26/$N24),1)","v":1},{"$f":"MIN(IF($B26,T24+IF(ISNUMBER(S25),S25,0),T26/$N24),1)","v":1},{"$f":"MIN(IF($B26,U24+IF(ISNUMBER(T25),T25,0),U26/$N24),1)","v":1},{"$f":"MIN(IF($B26,V24+IF(ISNUMBER(U25),U25,0),V26/$N24),1)","v":1},{"$f":"MIN(IF($B26,W24+IF(ISNUMBER(V25),V25,0),W26/$N24),1)","v":1},null,null,null,null,null,{"$f":"MIN(IF($B26,AC24+IF(ISNUMBER(AB25),AB25,0),AC26/$N24),1)","v":0}]
[{"$f":"OFFSET(A26,-CFF.NumLinha,0)+1","v":3},{"$f":"$C26>=OFFSET($C26,CFF.NumLinha,0)","v":true},{"$f":"INDEX(PO!A$12:A$58,MATCH($A26,PO!$V$12:$V$58,0))","v":3},{"$f":"IF(ISERROR(J26),I26,SMALL(I26:J26,1))-1","v":2},{"$f":"IF($C26=1,OFFSET(E26,-CFF.NumLinha,0)+1,OFFSET(E26,-CFF.NumLinha,0))","v":1},{"$f":"IF($C26=1,0,IF($C26=2,OFFSET(F26,-CFF.NumLinha,0)+1,OFFSET(F26,-CFF.NumLinha,0)))","v":1},{"$f":"IF(AND($C26<=2,$C26<>0),0,IF($C26=3,OFFSET(G26,-CFF.NumLinha,0)+1,OFFSET(G26,-CFF.NumLinha,0)))","v":1},{"$f":"IF(AND($C26<=3,$C26<>0),0,IF($C26=4,OFFSET(H26,-CFF.NumLinha,0)+1,OFFSET(H26,-CFF.NumLinha,0)))","v":0},{"$f":"MATCH(0,OFFSET($D26,1,$C26,ROW($A$48)-ROW($A26)),0)","v":22},{"$f":"MATCH(OFFSET($D26,0,$C26)+1,OFFSET($D26,1,$C26,ROW($A$48)-ROW($A26)),0)","v":3},{"$f":"ROUND(INDEX(PO!T$12:T$58,MATCH($A26,PO!$V$12:$V$58,0)),2)+10^-12","v":5913.3900000000012},null,null,null,"Acumulado (R$)",{"$f":"IF($B26,ROUND(P25*$N24,2),ROUND(SUMIF(OFFSET($B26,1,0,$D26),TRUE,OFFSET(P26,1,0,$D26))/SUMIF(OFFSET($B26,1,0,$D26),TRUE,OFFSET($K26,1,0,$D26))*$N24,2))","v":5913.39},5913.39,5913.39,5913.39,5913.39,5913.39,5913.39,5913.39,null,null,null,null,null,{"$f":"IF($B26,ROUND(AC25*$N24,2),ROUND(SUMIF(OFFSET($B26,1,0,$D26),TRUE,OFFSET(AC26,1,0,$D26))/SUMIF(OFFSET($B26,1,0,$D26),TRUE,OFFSET($K26,1,0,$D26))*$N24,2))","v":0}]
[null,null,null,null,null,null,null,null,null,null,null,{"$f":"INDEX(PO!K$12:K$58,MATCH($A29,PO!$V$12:$V$58,0))","v":"1.1.2."},{"$f":"INDEX(PO!N$12:N$58,MATCH($A29,PO!$V$12:$V$58,0))","v":"DRENAGEM E RECOMPOSIÇÃO DE PAVIMENTO "},{"$f":"IF(ROUND(K29,2)=0,K29,ROUND(K29,2))","v":83441.95},"Parcela (%)",0.5,0.5,0,{"$f":"IF($B29,0,S28-IF(ISNUMBER(R28),R28,0))","v":0},{"$f":"IF($B29,0,T28-IF(ISNUMBER(S28),S28,0))","v":0},{"$f":"IF($B29,0,U28-IF(ISNUMBER(T28),T28,0))","v":0},{"$f":"IF($B29,0,V28-IF(ISNUMBER(U28),U28,0))","v":0},{"$f":"IF($B29,0,W28-IF(ISNUMBER(V28),V28,0))","v":0},null,null,null,null,null,{"$f":"IF($B29,0,AC28-IF(ISNUMBER(AB28),AB28,0))","v":0}]
[null,null,null,null,null,null,null,null,null,null,null,null,null,null,"Acumulado (%)",{"$f":"MIN(IF($B29,P27+IF(ISNUMBER(O28),O28,0),P29/$N27),1)","v":0.5},{"$f":"MIN(IF($B29,Q27+IF(ISNUMBER(P28),P28,0),Q29/$N27),1)","v":1},{"$f":"MIN(IF($B29,R27+IF(ISNUMBER(Q28),Q28,0),R29/$N27),1)","v":1},{"$f":"MIN(IF($B29,S27+IF(ISNUMBER(R28),R28,0),S29/$N27),1)","v":1},{"$f":"MIN(IF($B29,T27+IF(ISNUMBER(S28),S28,0),T29/$N27),1)","v":1},{"$f":"MIN(IF($B29,U27+IF(ISNUMBER(T28),T28,0),U29/$N27),1)","v":1},{"$f":"MIN(IF($B29,V27+IF(ISNUMBER(U28),U28,0),V29/$N27),1)","v":1},{"$f":"MIN(IF($B29,W27+IF(ISNUMBER(V28),V28,0),W29/$N27),1)","v":1},null,null,null,null,null,{"$f":"MIN(IF($B29,AC27+IF(ISNUMBER(AB28),AB28,0),AC29/$N27),1)","v":0}]
[{"$f":"OFFSET(A29,-CFF.NumLinha,0)+1","v":4},{"$f":"$C29>=OFFSET($C29,CFF.NumLinha,0)","v":true},{"$f":"INDEX(PO!A$12:A$58,MATCH($A29,PO!$V$12:$V$58,0))","v":3},{"$f":"IF(ISERROR(J29),I29,SMALL(I29:J29,1))-1","v":2},{"$f":"IF($C29=1,OFFSET(E29,-CFF.NumLinha,0)+1,OFFSET(E29,-CFF.NumLinha,0))","v":1},{"$f":"IF($C29=1,0,IF($C29=2,OFFSET(F29,-CFF.NumLinha,0)+1,OFFSET(F29,-CFF.NumLinha,0)))","v":1},{"$f":"IF(AND($C29<=2,$C29<>0),0,IF($C29=3,OFFSET(G29,-CFF.NumLinha,0)+1,OFFSET(G29,-CFF.NumLinha,0)))","v":2},{"$f":"IF(AND($C29<=3,$C29<>0),0,IF($C29=4,OFFSET(H29,-CFF.NumLinha,0)+1,OFFSET(H29,-CFF.NumLinha,0)))","v":0},{"$f":"MATCH(0,OFFSET($D29,1,$C29,ROW($A$48)-ROW($A29)),0)","v":19},{"$f":"MATCH(OFFSET($D29,0,$C29)+1,OFFSET($D29,1,$C29,ROW($A$48)-ROW($A29)),0)","v":3},{"$f":"ROUND(INDEX(PO!T$12:T$58,MATCH($A29,PO!$V$12:$V$58,0)),2)+10^-12","v":83441.95},null,null,null,"Acumulado (R$)",{"$f":"IF($B29,ROUND(P28*$N27,2),ROUND(SUMIF(OFFSET($B29,1,0,$D29),TRUE,OFFSET(P29,1,0,$D29))/SUMIF(OFFSET($B29,1,0,$D29),TRUE,OFFSET($K29,1,0,$D29))*$N27,2))","v":41720.980000000003},83441.95,83441.95,83441.95,83441.95,83441.95,83441.95,83441.95,null,null,null,null,null,{"$f":"IF($B29,ROUND(AC28*$N27,2),ROUND(SUMIF(OFFSET($B29,1,0,$D29),TRUE,OFFSET(AC29,1,0,$D29))/SUMIF(OFFSET($B29,1,0,$D29),TRUE,OFFSET($K29,1,0,$D29))*$N27,2))","v":0}]
[null,null,null,null,null,null,null,null,null,null,null,{"$f":"INDEX(PO!K$12:K$58,MATCH($A32,PO!$V$12:$V$58,0))","v":"1.1.3."},{"$f":"INDEX(PO!N$12:N$58,MATCH($A32,PO!$V$12:$V$58,0))","v":"MEIOS - FIOS "},{"$f":"IF(ROUND(K32,2)=0,K32,ROUND(K32,2))","v":24165.81},"Parcela (%)",0,0,0.5,0.5,{"$f":"IF($B32,0,T31-IF(ISNUMBER(S31),S31,0))","v":0},{"$f":"IF($B32,0,U31-IF(ISNUMBER(T31),T31,0))","v":0},{"$f":"IF($B32,0,V31-IF(ISNUMBER(U31),U31,0))","v":0},{"$f":"IF($B32,0,W31-IF(ISNUMBER(V31),V31,0))","v":0},null,null,null,null,null,{"$f":"IF($B32,0,AC31-IF(ISNUMBER(AB31),AB31,0))","v":0}]
[null,null,null,null,null,null,null,null,null,null,null,null,null,null,"Acumulado (%)",{"$f":"MIN(IF($B32,P30+IF(ISNUMBER(O31),O31,0),P32/$N30),1)","v":0},{"$f":"MIN(IF($B32,Q30+IF(ISNUMBER(P31),P31,0),Q32/$N30),1)","v":0},{"$f":"MIN(IF($B32,R30+IF(ISNUMBER(Q31),Q31,0),R32/$N30),1)","v":0.5},{"$f":"MIN(IF($B32,S30+IF(ISNUMBER(R31),R31,0),S32/$N30),1)","v":1},{"$f":"MIN(IF($B32,T30+IF(ISNUMBER(S31),S31,0),T32/$N30),1)","v":1},{"$f":"MIN(IF($B32,U30+IF(ISNUMBER(T31),T31,0),U32/$N30),1)","v":1},{"$f":"MIN(IF($B32,V30+IF(ISNUMBER(U31),U31,0),V32/$N30),1)","v":1},{"$f":"MIN(IF($B32,W30+IF(ISNUMBER(V31),V31,0),W32/$N30),1)","v":1},null,null,null,null,null,{"$f":"MIN(IF($B32,AC30+IF(ISNUMBER(AB31),AB31,0),AC32/$N30),1)","v":0}]
[{"$f":"OFFSET(A32,-CFF.NumLinha,0)+1","v":5},{"$f":"$C32>=OFFSET($C32,CFF.NumLinha,0)","v":true},{"$f":"INDEX(PO!A$12:A$58,MATCH($A32,PO!$V$12:$V$58,0))","v":3},{"$f":"IF(ISERROR(J32),I32,SMALL(I32:J32,1))-1","v":2},{"$f":"IF($C32=1,OFFSET(E32,-CFF.NumLinha,0)+1,OFFSET(E32,-CFF.NumLinha,0))","v":1},{"$f":"IF($C32=1,0,IF($C32=2,OFFSET(F32,-CFF.NumLinha,0)+1,OFFSET(F32,-CFF.NumLinha,0)))","v":1},{"$f":"IF(AND($C32<=2,$C32<>0),0,IF($C32=3,OFFSET(G32,-CFF.NumLinha,0)+1,OFFSET(G32,-CFF.NumLinha,0)))","v":3},{"$f":"IF(AND($C32<=3,$C32<>0),0,IF($C32=4,OFFSET(H32,-CFF.NumLinha,0)+1,OFFSET(H32,-CFF.NumLinha,0)))","v":0},{"$f":"MATCH(0,OFFSET($D32,1,$C32,ROW($A$48)-ROW($A32)),0)","v":16},{"$f":"MATCH(OFFSET($D32,0,$C32)+1,OFFSET($D32,1,$C32,ROW($A$48)-ROW($A32)),0)","v":3},{"$f":"ROUND(INDEX(PO!T$12:T$58,MATCH($A32,PO!$V$12:$V$58,0)),2)+10^-12","v":24165.81},null,null,null,"Acumulado (R$)",{"$f":"IF($B32,ROUND(P31*$N30,2),ROUND(SUMIF(OFFSET($B32,1,0,$D32),TRUE,OFFSET(P32,1,0,$D32))/SUMIF(OFFSET($B32,1,0,$D32),TRUE,OFFSET($K32,1,0,$D32))*$N30,2))","v":0},0,12082.91,24165.81,24165.81,24165.81,24165.81,24165.81,null,null,null,null,null,{"$f":"IF($B32,ROUND(AC31*$N30,2),ROUND(SUMIF(OFFSET($B32,1,0,$D32),TRUE,OFFSET(AC32,1,0,$D32))/SUMIF(OFFSET($B32,1,0,$D32),TRUE,OFFSET($K32,1,0,$D32))*$N30,2))","v":0}]
[null,null,null,null,null,null,null,null,null,null,null,{"$f":"INDEX(PO!K$12:K$58,MATCH($A35,PO!$V$12:$V$58,0))","v":"1.1.4."},{"$f":"INDEX(PO!N$12:N$58,MATCH($A35,PO!$V$12:$V$58,0))","v":"PAVIMENTAÇÃO ASFÁLTICA SOBRE LEITO NATURAL"},{"$f":"IF(ROUND(K35,2)=0,K35,ROUND(K35,2))","v":295268.96000000002},"Parcela (%)",0,0.25,0.25,0.5,{"$f":"IF($B35,0,T34-IF(ISNUMBER(S34),S34,0))","v":0},{"$f":"IF($B35,0,U34-IF(ISNUMBER(T34),T34,0))","v":0},{"$f":"IF($B35,0,V34-IF(ISNUMBER(U34),U34,0))","v":0},{"$f":"IF($B35,0,W34-IF(ISNUMBER(V34),V34,0))","v":0},null,null,null,null,null,{"$f":"IF($B35,0,AC34-IF(ISNUMBER(AB34),AB34,0))","v":0}]
[null,null,null,null,null,null,null,null,null,null,null,null,null,null,"Acumulado (%)",{"$f":"MIN(IF($B35,P33+IF(ISNUMBER(O34),O34,0),P35/$N33),1)","v":0},{"$f":"MIN(IF($B35,Q33+IF(ISNUMBER(P34),P34,0),Q35/$N33),1)","v":0.25},{"$f":"MIN(IF($B35,R33+IF(ISNUMBER(Q34),Q34,0),R35/$N33),1)","v":0.5},{"$f":"MIN(IF($B35,S33+IF(ISNUMBER(R34),R34,0),S35/$N33),1)","v":1},{"$f":"MIN(IF($B35,T33+IF(ISNUMBER(S34),S34,0),T35/$N33),1)","v":1},{"$f":"MIN(IF($B35,U33+IF(ISNUMBER(T34),T34,0),U35/$N33),1)","v":1},{"$f":"MIN(IF($B35,V33+IF(ISNUMBER(U34),U34,0),V35/$N33),1)","v":1},{"$f":"MIN(IF($B35,W33+IF(ISNUMBER(V34),V34,0),W35/$N33),1)","v":1},null,null,null,null,null,{"$f":"MIN(IF($B35,AC33+IF(ISNUMBER(AB34),AB34,0),AC35/$N33),1)","v":0}]
[{"$f":"OFFSET(A35,-CFF.NumLinha,0)+1","v":6},{"$f":"$C35>=OFFSET($C35,CFF.NumLinha,0)","v":true},{"$f":"INDEX(PO!A$12:A$58,MATCH($A35,PO!$V$12:$V$58,0))","v":3},{"$f":"IF(ISERROR(J35),I35,SMALL(I35:J35,1))-1","v":2},{"$f":"IF($C35=1,OFFSET(E35,-CFF.NumLinha,0)+1,OFFSET(E35,-CFF.NumLinha,0))","v":1},{"$f":"IF($C35=1,0,IF($C35=2,OFFSET(F35,-CFF.NumLinha,0)+1,OFFSET(F35,-CFF.NumLinha,0)))","v":1},{"$f":"IF(AND($C35<=2,$C35<>0),0,IF($C35=3,OFFSET(G35,-CFF.NumLinha,0)+1,OFFSET(G35,-CFF.NumLinha,0)))","v":4},{"$f":"IF(AND($C35<=3,$C35<>0),0,IF($C35=4,OFFSET(H35,-CFF.NumLinha,0)+1,OFFSET(H35,-CFF.NumLinha,0)))","v":0},{"$f":"MATCH(0,OFFSET($D35,1,$C35,ROW($A$48)-ROW($A35)),0)","v":13},{"$f":"MATCH(OFFSET($D35,0,$C35)+1,OFFSET($D35,1,$C35,ROW($A$48)-ROW($A35)),0)","v":3},{"$f":"ROUND(INDEX(PO!T$12:T$58,MATCH($A35,PO!$V$12:$V$58,0)),2)+10^-12","v":295268.96000000002},null,null,null,"Acumulado (R$)",{"$f":"IF($B35,ROUND(P34*$N33,2),ROUND(SUMIF(OFFSET($B35,1,0,$D35),TRUE,OFFSET(P35,1,0,$D35))/SUMIF(OFFSET($B35,1,0,$D35),TRUE,OFFSET($K35,1,0,$D35))*$N33,2))","v":0},73817.240000000005,147634.48000000001,295268.96000000002,295268.96000000002,295268.96000000002,295268.96000000002,295268.96000000002,null,null,null,null,null,{"$f":"IF($B35,ROUND(AC34*$N33,2),ROUND(SUMIF(OFFSET($B35,1,0,$D35),TRUE,OFFSET(AC35,1,0,$D35))/SUMIF(OFFSET($B35,1,0,$D35),TRUE,OFFSET($K35,1,0,$D35))*$N33,2))","v":0}]
[null,null,null,null,null,null,null,null,null,null,null,{"$f":"INDEX(PO!K$12:K$58,MATCH($A38,PO!$V$12:$V$58,0))","v":"1.1.5."},{"$f":"INDEX(PO!N$12:N$58,MATCH($A38,PO!$V$12:$V$58,0))","v":"PASSEIOS"},{"$f":"IF(ROUND(K38,2)=0,K38,ROUND(K38,2))","v":55455.65},"Parcela (%)",0,0,0,0.3,0.4,0.3,{"$f":"IF($B38,0,V37-IF(ISNUMBER(U37),U37,0))","v":0},{"$f":"IF($B38,0,W37-IF(ISNUMBER(V37),V37,0))","v":0},null,null,null,null,null,{"$f":"IF($B38,0,AC37-IF(ISNUMBER(AB37),AB37,0))","v":0}]
[null,null,null,null,null,null,null,null,null,null,null,null,null,null,"Acumulado (%)",{"$f":"MIN(IF($B38,P36+IF(ISNUMBER(O37),O37,0),P38/$N36),1)","v":0},{"$f":"MIN(IF($B38,Q36+IF(ISNUMBER(P37),P37,0),Q38/$N36),1)","v":0},{"$f":"MIN(IF($B38,R36+IF(ISNUMBER(Q37),Q37,0),R38/$N36),1)","v":0},{"$f":"MIN(IF($B38,S36+IF(ISNUMBER(R37),R37,0),S38/$N36),1)","v":0.3},{"$f":"MIN(IF($B38,T36+IF(ISNUMBER(S37),S37,0),T38/$N36),1)","v":0.7},{"$f":"MIN(IF($B38,U36+IF(ISNUMBER(T37),T37,0),U38/$N36),1)","v":1},{"$f":"MIN(IF($B38,V36+IF(ISNUMBER(U37),U37,0),V38/$N36),1)","v":1},{"$f":"MIN(IF($B38,W36+IF(ISNUMBER(V37),V37,0),W38/$N36),1)","v":1},null,null,null,null,null,{"$f":"MIN(IF($B38,AC36+IF(ISNUMBER(AB37),AB37,0),AC38/$N36),1)","v":0}]
[{"$f":"OFFSET(A38,-CFF.NumLinha,0)+1","v":7},{"$f":"$C38>=OFFSET($C38,CFF.NumLinha,0)","v":true},{"$f":"INDEX(PO!A$12:A$58,MATCH($A38,PO!$V$12:$V$58,0))","v":3},{"$f":"IF(ISERROR(J38),I38,SMALL(I38:J38,1))-1","v":2},{"$f":"IF($C38=1,OFFSET(E38,-CFF.NumLinha,0)+1,OFFSET(E38,-CFF.NumLinha,0))","v":1},{"$f":"IF($C38=1,0,IF($C38=2,OFFSET(F38,-CFF.NumLinha,0)+1,OFFSET(F38,-CFF.NumLinha,0)))","v":1},{"$f":"IF(AND($C38<=2,$C38<>0),0,IF($C38=3,OFFSET(G38,-CFF.NumLinha,0)+1,OFFSET(G38,-CFF.NumLinha,0)))","v":5},{"$f":"IF(AND($C38<=3,$C38<>0),0,IF($C38=4,OFFSET(H38,-CFF.NumLinha,0)+1,OFFSET(H38,-CFF.NumLinha,0)))","v":0},{"$f":"MATCH(0,OFFSET($D38,1,$C38,ROW($A$48)-ROW($A38)),0)","v":10},{"$f":"MATCH(OFFSET($D38,0,$C38)+1,OFFSET($D38,1,$C38,ROW($A$48)-ROW($A38)),0)","v":3},{"$f":"ROUND(INDEX(PO!T$12:T$58,MATCH($A38,PO!$V$12:$V$58,0)),2)+10^-12","v":55455.65},null,null,null,"Acumulado (R$)",{"$f":"IF($B38,ROUND(P37*$N36,2),ROUND(SUMIF(OFFSET($B38,1,0,$D38),TRUE,OFFSET(P38,1,0,$D38))/SUMIF(OFFSET($B38,1,0,$D38),TRUE,OFFSET($K38,1,0,$D38))*$N36,2))","v":0},0,0,16636.7,38818.959999999999,55455.65,55455.65,55455.65,null,null,null,null,null,{"$f":"IF($B38,ROUND(AC37*$N36,2),ROUND(SUMIF(OFFSET($B38,1,0,$D38),TRUE,OFFSET(AC38,1,0,$D38))/SUMIF(OFFSET($B38,1,0,$D38),TRUE,OFFSET($K38,1,0,$D38))*$N36,2))","v":0}]
[null,null,null,null,null,null,null,null,null,null,null,{"$f":"INDEX(PO!K$12:K$58,MATCH($A41,PO!$V$12:$V$58,0))","v":"1.1.6."},{"$f":"INDEX(PO!N$12:N$58,MATCH($A41,PO!$V$12:$V$58,0))","v":"MURETA DE BALISAMENTO EM CONCRETO"},{"$f":"IF(ROUND(K41,2)=0,K41,ROUND(K41,2))","v":16526.330000000002},"Parcela (%)",0,0,0,0.3,0.4,0.3,{"$f":"IF($B41,0,V40-IF(ISNUMBER(U40),U40,0))","v":0},{"$f":"IF($B41,0,W40-IF(ISNUMBER(V40),V40,0))","v":0},null,null,null,null,null,{"$f":"IF($B41,0,AC40-IF(ISNUMBER(AB40),AB40,0))","v":0}]
[null,null,null,null,null,null,null,null,null,null,null,null,null,null,"Acumulado (%)",{"$f":"MIN(IF($B41,P39+IF(ISNUMBER(O40),O40,0),P41/$N39),1)","v":0},{"$f":"MIN(IF($B41,Q39+IF(ISNUMBER(P40),P40,0),Q41/$N39),1)","v":0},{"$f":"MIN(IF($B41,R39+IF(ISNUMBER(Q40),Q40,0),R41/$N39),1)","v":0},{"$f":"MIN(IF($B41,S39+IF(ISNUMBER(R40),R40,0),S41/$N39),1)","v":0.3},{"$f":"MIN(IF($B41,T39+IF(ISNUMBER(S40),S40,0),T41/$N39),1)","v":0.7},{"$f":"MIN(IF($B41,U39+IF(ISNUMBER(T40),T40,0),U41/$N39),1)","v":1},{"$f":"MIN(IF($B41,V39+IF(ISNUMBER(U40),U40,0),V41/$N39),1)","v":1},{"$f":"MIN(IF($B41,W39+IF(ISNUMBER(V40),V40,0),W41/$N39),1)","v":1},null,null,null,null,null,{"$f":"MIN(IF($B41,AC39+IF(ISNUMBER(AB40),AB40,0),AC41/$N39),1)","v":0}]
[{"$f":"OFFSET(A41,-CFF.NumLinha,0)+1","v":8},{"$f":"$C41>=OFFSET($C41,CFF.NumLinha,0)","v":true},{"$f":"INDEX(PO!A$12:A$58,MATCH($A41,PO!$V$12:$V$58,0))","v":3},{"$f":"IF(ISERROR(J41),I41,SMALL(I41:J41,1))-1","v":2},{"$f":"IF($C41=1,OFFSET(E41,-CFF.NumLinha,0)+1,OFFSET(E41,-CFF.NumLinha,0))","v":1},{"$f":"IF($C41=1,0,IF($C41=2,OFFSET(F41,-CFF.NumLinha,0)+1,OFFSET(F41,-CFF.NumLinha,0)))","v":1},{"$f":"IF(AND($C41<=2,$C41<>0),0,IF($C41=3,OFFSET(G41,-CFF.NumLinha,0)+1,OFFSET(G41,-CFF.NumLinha,0)))","v":6},{"$f":"IF(AND($C41<=3,$C41<>0),0,IF($C41=4,OFFSET(H41,-CFF.NumLinha,0)+1,OFFSET(H41,-CFF.NumLinha,0)))","v":0},{"$f":"MATCH(0,OFFSET($D41,1,$C41,ROW($A$48)-ROW($A41)),0)","v":7},{"$f":"MATCH(OFFSET($D41,0,$C41)+1,OFFSET($D41,1,$C41,ROW($A$48)-ROW($A41)),0)","v":3},{"$f":"ROUND(INDEX(PO!T$12:T$58,MATCH($A41,PO!$V$12:$V$58,0)),2)+10^-12","v":16526.330000000002},null,null,null,"Acumulado (R$)",{"$f":"IF($B41,ROUND(P40*$N39,2),ROUND(SUMIF(OFFSET($B41,1,0,$D41),TRUE,OFFSET(P41,1,0,$D41))/SUMIF(OFFSET($B41,1,0,$D41),TRUE,OFFSET($K41,1,0,$D41))*$N39,2))","v":0},0,0,4957.8999999999996,11568.43,16526.330000000002,16526.330000000002,16526.330000000002,null,null,null,null,null,{"$f":"IF($B41,ROUND(AC40*$N39,2),ROUND(SUMIF(OFFSET($B41,1,0,$D41),TRUE,OFFSET(AC41,1,0,$D41))/SUMIF(OFFSET($B41,1,0,$D41),TRUE,OFFSET($K41,1,0,$D41))*$N39,2))","v":0}]
[null,null,null,null,null,null,null,null,null,null,null,{"$f":"INDEX(PO!K$12:K$58,MATCH($A44,PO!$V$12:$V$58,0))","v":"1.1.7."},{"$f":"INDEX(PO!N$12:N$58,MATCH($A44,PO!$V$12:$V$58,0))","v":"PINTURA E SINALIZAÇÃO"},{"$f":"IF(ROUND(K44,2)=0,K44,ROUND(K44,2))","v":7327.67},"Parcela (%)",0,0,0,0,0,1,{"$f":"IF($B44,0,V43-IF(ISNUMBER(U43),U43,0))","v":0},{"$f":"IF($B44,0,W43-IF(ISNUMBER(V43),V43,0))","v":0},null,null,null,null,null,{"$f":"IF($B44,0,AC43-IF(ISNUMBER(AB43),AB43,0))","v":0}]
[null,null,null,null,null,null,null,null,null,null,null,null,null,null,"Acumulado (%)",{"$f":"MIN(IF($B44,P42+IF(ISNUMBER(O43),O43,0),P44/$N42),1)","v":0},{"$f":"MIN(IF($B44,Q42+IF(ISNUMBER(P43),P43,0),Q44/$N42),1)","v":0},{"$f":"MIN(IF($B44,R42+IF(ISNUMBER(Q43),Q43,0),R44/$N42),1)","v":0},{"$f":"MIN(IF($B44,S42+IF(ISNUMBER(R43),R43,0),S44/$N42),1)","v":0},{"$f":"MIN(IF($B44,T42+IF(ISNUMBER(S43),S43,0),T44/$N42),1)","v":0},{"$f":"MIN(IF($B44,U42+IF(ISNUMBER(T43),T43,0),U44/$N42),1)","v":1},{"$f":"MIN(IF($B44,V42+IF(ISNUMBER(U43),U43,0),V44/$N42),1)","v":1},{"$f":"MIN(IF($B44,W42+IF(ISNUMBER(V43),V43,0),W44/$N42),1)","v":1},null,null,null,null,null,{"$f":"MIN(IF($B44,AC42+IF(ISNUMBER(AB43),AB43,0),AC44/$N42),1)","v":0}]
[{"$f":"OFFSET(A44,-CFF.NumLinha,0)+1","v":9},{"$f":"$C44>=OFFSET($C44,CFF.NumLinha,0)","v":true},{"$f":"INDEX(PO!A$12:A$58,MATCH($A44,PO!$V$12:$V$58,0))","v":3},{"$f":"IF(ISERROR(J44),I44,SMALL(I44:J44,1))-1","v":2},{"$f":"IF($C44=1,OFFSET(E44,-CFF.NumLinha,0)+1,OFFSET(E44,-CFF.NumLinha,0))","v":1},{"$f":"IF($C44=1,0,IF($C44=2,OFFSET(F44,-CFF.NumLinha,0)+1,OFFSET(F44,-CFF.NumLinha,0)))","v":1},{"$f":"IF(AND($C44<=2,$C44<>0),0,IF($C44=3,OFFSET(G44,-CFF.NumLinha,0)+1,OFFSET(G44,-CFF.NumLinha,0)))","v":7},{"$f":"IF(AND($C44<=3,$C44<>0),0,IF($C44=4,OFFSET(H44,-CFF.NumLinha,0)+1,OFFSET(H44,-CFF.NumLinha,0)))","v":0},{"$f":"MATCH(0,OFFSET($D44,1,$C44,ROW($A$48)-ROW($A44)),0)","v":4},{"$f":"MATCH(OFFSET($D44,0,$C44)+1,OFFSET($D44,1,$C44,ROW($A$48)-ROW($A44)),0)","v":3},{"$f":"ROUND(INDEX(PO!T$12:T$58,MATCH($A44,PO!$V$12:$V$58,0)),2)+10^-12","v":7327.670000000001},null,null,null,"Acumulado (R$)",{"$f":"IF($B44,ROUND(P43*$N42,2),ROUND(SUMIF(OFFSET($B44,1,0,$D44),TRUE,OFFSET(P44,1,0,$D44))/SUMIF(OFFSET($B44,1,0,$D44),TRUE,OFFSET($K44,1,0,$D44))*$N42,2))","v":0},0,0,0,0,7327.67,7327.67,7327.67,null,null,null,null,null,{"$f":"IF($B44,ROUND(AC43*$N42,2),ROUND(SUMIF(OFFSET($B44,1,0,$D44),TRUE,OFFSET(AC44,1,0,$D44))/SUMIF(OFFSET($B44,1,0,$D44),TRUE,OFFSET($K44,1,0,$D44))*$N42,2))","v":0}]
[null,null,null,null,null,null,null,null,null,null,null,{"$f":"INDEX(PO!K$12:K$58,MATCH($A47,PO!$V$12:$V$58,0))","v":"1.1.8."},{"$f":"INDEX(PO!N$12:N$58,MATCH($A47,PO!$V$12:$V$58,0))","v":"SERVIÇOS COMPLEMENTARES - LIMPEZA FINAL DA OBRA"},{"$f":"IF(ROUND(K47,2)=0,K47,ROUND(K47,2))","v":1619.5},"Parcela (%)",0,0,0,0,0,1,{"$f":"IF($B47,0,V46-IF(ISNUMBER(U46),U46,0))","v":0},{"$f":"IF($B47,0,W46-IF(ISNUMBER(V46),V46,0))","v":0},null,null,null,null,null,{"$f":"IF($B47,0,AC46-IF(ISNUMBER(AB46),AB46,0))","v":0}]
[null,null,null,null,null,null,null,null,null,null,null,null,null,null,"Acumulado (%)",{"$f":"MIN(IF($B47,P45+IF(ISNUMBER(O46),O46,0),P47/$N45),1)","v":0},{"$f":"MIN(IF($B47,Q45+IF(ISNUMBER(P46),P46,0),Q47/$N45),1)","v":0},{"$f":"MIN(IF($B47,R45+IF(ISNUMBER(Q46),Q46,0),R47/$N45),1)","v":0},{"$f":"MIN(IF($B47,S45+IF(ISNUMBER(R46),R46,0),S47/$N45),1)","v":0},{"$f":"MIN(IF($B47,T45+IF(ISNUMBER(S46),S46,0),T47/$N45),1)","v":0},{"$f":"MIN(IF($B47,U45+IF(ISNUMBER(T46),T46,0),U47/$N45),1)","v":1},{"$f":"MIN(IF($B47,V45+IF(ISNUMBER(U46),U46,0),V47/$N45),1)","v":1},{"$f":"MIN(IF($B47,W45+IF(ISNUMBER(V46),V46,0),W47/$N45),1)","v":1},null,null,null,null,null,{"$f":"MIN(IF($B47,AC45+IF(ISNUMBER(AB46),AB46,0),AC47/$N45),1)","v":0}]
[{"$f":"OFFSET(A47,-CFF.NumLinha,0)+1","v":10},{"$f":"$C47>=OFFSET($C47,CFF.NumLinha,0)","v":true},{"$f":"INDEX(PO!A$12:A$58,MATCH($A47,PO!$V$12:$V$58,0))","v":3},{"$f":"IF(ISERROR(J47),I47,SMALL(I47:J47,1))-1","v":0},{"$f":"IF($C47=1,OFFSET(E47,-CFF.NumLinha,0)+1,OFFSET(E47,-CFF.NumLinha,0))","v":1},{"$f":"IF($C47=1,0,IF($C47=2,OFFSET(F47,-CFF.NumLinha,0)+1,OFFSET(F47,-CFF.NumLinha,0)))","v":1},{"$f":"IF(AND($C47<=2,$C47<>0),0,IF($C47=3,OFFSET(G47,-CFF.NumLinha,0)+1,OFFSET(G47,-CFF.NumLinha,0)))","v":8},{"$f":"IF(AND($C47<=3,$C47<>0),0,IF($C47=4,OFFSET(H47,-CFF.NumLinha,0)+1,OFFSET(H47,-CFF.NumLinha,0)))","v":0},{"$f":"MATCH(0,OFFSET($D47,1,$C47,ROW($A$48)-ROW($A47)),0)","v":1},{"$f":"MATCH(OFFSET($D47,0,$C47)+1,OFFSET($D47,1,$C47,ROW($A$48)-ROW($A47)),0)","v":{"$error":"#N/A"}},{"$f":"ROUND(INDEX(PO!T$12:T$58,MATCH($A47,PO!$V$12:$V$58,0)),2)+10^-12","v":1619.5000000000009},null,null,null,"Acumulado (R$)",{"$f":"IF($B47,ROUND(P46*$N45,2),ROUND(SUMIF(OFFSET($B47,1,0,$D47),TRUE,OFFSET(P47,1,0,$D47))/SUMIF(OFFSET($B47,1,0,$D47),TRUE,OFFSET($K47,1,0,$D47))*$N45,2))","v":0},0,0,0,0,1619.5,1619.5,1619.5,null,null,null,null,null,{"$f":"IF($B47,ROUND(AC46*$N45,2),ROUND(SUMIF(OFFSET($B47,1,0,$D47),TRUE,OFFSET(AC47,1,0,$D47))/SUMIF(OFFSET($B47,1,0,$D47),TRUE,OFFSET($K47,1,0,$D47))*$N45,2))","v":0}]
[null,null,-1,null,0,0,0,0]
[]
[null,null,null,null,null,null,null,null,null,null,null,{"$f":"DADOS!I32","v":0}]
[null,null,null,null,null,null,null,null,null,null,null,"Local"]
[]
[null,null,null,null,null,null,null,null,null,null,null,{"$f":"PO!K72","v":"2022-04-11"}]
[null,null,null,null,null,null,null,null,null,null,null,"Data"]